{"text_format":"1","workbook":"xlsx","n_sheets":26,"sheets":["Documentation","Aggregates","Additives","Binders","Initial_Info1","Blending","Batching","Cost_Analysis","MO_JMF_Std","Blend_AggSpG_PI","Agg_SpG","Agg_PI","CoreLokAggSpG","CoreLok_SpG","Volumetrics","403_Graphs","401_Graphs","RAP_RAS","Recycle_Binder_Contrib","T_283","Consensus","SMA_VCA-Draindown","Non-Carbonate","UBAWS_Agg","Shot Rate","Film Thickness"],"not_rendered":{"charts":15,"images":9,"macros":1,"external_links":0,"defined_names":51,"comments":0,"pivot_tables":0},"unopened":[],"bounds":{"document_bytes":16777216,"sheet_cells":100000,"rows_first":2000,"rows_last":500,"rows_between":2000,"halvings":0,"cell_chars":16384,"cell_head_chars":4096},"cells_cut":0,"cells_raw":0,"read":"whole","date_system":"1900"}

{"sheet":"Documentation","index":0,"n_rows":28,"n_cols":6,"rows_kept":28,"cut":false,"hidden":false,"merged":[]}
[null,null,null,null,null,"Missouri Job Mix Formula (JMF) Submittal Workbook"]
[null,null,null,null,null,"2016-02-16"]
[null,null,null,null,null,"Compiled in Excel 2013"]
[]
[1,"The purpose of this workbook is to provide uniform submittal to MoDOT to reduce errors and provide more timely approvals."]
[2,"Not all data entered into the spreadsheet will be transferred to the submitted JMF, i.e. cost data."]
[3,"Enter Aggregates, Additives and Binders in data sheets.  Aggregates will be automatically populated with specific gravities when entered into either Agg_SpG or CoreLok_SpG."]
[null,"Use temporary material identification numbers in place of material identification numbers not yet received from MoDOT.  Check sheets with picklist selections for updating."]
[null,"Columns marked with a down arrow, i.e. PLANT ↓, use a pick list to choose the desired item.  If a list does not appear, copy the cell validation from the cells above the one desired."]
[null,"Named ranges are automatically updated upon exiting sheet.  Exit sheet before checking to verify updating of ranges."]
[null,"To cut and paste data in the Aggregate sheet, it may be necessary to Unprotect the sheet.  It will automatically Protect after pasting."]
[4,"Enter project and mix data in the Initial_Info1 sheet.  Aggregate cold feed percentages are entered on the Blending sheet."]
[5,"Enter Binder with in-line grading along with Additive rates  in the Initial_Info1 sheet."]
[6,"The only reference to the Batching sheet is for an estimate of properties prior to entering test data.  Batching sheet may be copied by holding CTRL and dragging tab to new location."]
[7,"Enter mixture test data on Volumetrics sheet.  Marshall Stability and % Gmm should be accurately displayed based on compaction type."]
[null,"Five separate binder contents may be entered for Marshall or 4 binder points plus Nmax may be entered for Gyratory compaction."]
[null,"Rice gravities (Gmm) may be averaged or run at separate binder contents."]
[8,"Volumetric graphs  will populate for all data entered.  Submittal will be based on appropriate mixture type for Sec 403 or Sec 401."]
[null,"Surface Leveling will use 401 and UBAWS will use 403."]
[9,"Sheets pulling data from other sheets to make calculations are protected since no other input is needed."]
[10,"MO_JMF_Std has a button that generates the submission file.  It will automatically save the file in the same folder as this workbook as ContractorMixTypeUniqueNumber.xlxs"]
[null,"It may be necessary to choose Yes so that it will be saved as a macro-disabled file.  Any unnecessary sheets for submittal may be deleted."]
[]
[null,null,null,null,null,"Enter Plant Locations to be Used for Data Entry on Other Tabs."]
[]
[null,null,null,null,null,"Plant 1"]
[null,null,null,null,null,"Plant 2"]
[null,null,null,null,null,"Plant 3"]

{"sheet":"Aggregates","index":1,"n_rows":17,"n_cols":41,"rows_kept":17,"cut":false,"hidden":false,"merged":[[3,37,3,39],[3,34,3,36],[0,2,0,5],[1,2,1,5]]}
[null,null,"Enter Data for Aggregate Fractions Including Reclaimed Aggregates"]
[null,null,"(Aggregate Gravities Pulled From Worksheets Agg_SP, CoreLok_SP and RAP_RAS)"]
[]
[null,null,null,null,"FORMATION",null,null,null,null,null,"N/C",null,null,null,null,null,null,null,null,null,null,null,null,null,null,null,null,"RECYCLE",null,null,null,null,null,null,"T 84 / T 85",null,null,"CoreLok ",null,null,"Recycle"]
["MATERIAL ID","PLANT ↓","SUPPLIER","LOCATION","RAP / RAS","LEDGES","SOURCE ID","MAX SIZE ↓","GRADING ↓","CHERT","Yes/No","2\"","1 1/2\"","1\"","3/4\"","1/2\"","3/8\"","No.4","No.8","No.16","No.30","No.50","No.100","No.200","Gsb","Gsa","ABS.","% AC","PRICE",null,null,null,null,null,"Gsb","Gsa","Abs","Gsb","Gsa","Abs","Gsb (est)"]
[null,null,null,null,null,null,null,null,null,null,null,null,null,null,null,null,null,null,null,null,null,null,null,null,{"$f":"IF($AO6=\"\",IF(AL6=\"\",AI6,AL6),$AO6)","v":""},{"$f":"IF($AO6=\"\",IF(AM6=\"\",AJ6,AM6),$AO6)","v":""},{"$f":"IF($AO6=\"\",IF(AN6=\"\",AK6,AN6),\"\")","v":""},null,null,null,null,"2\"",null,"Clean",{"$f":"IF($A6=\"\",\"\",IF(OR(ISNA(INDEX(AggSG,MATCH(TRUE,(AggSGID=$A6),0),28)),ISBLANK(INDEX(AggSG,MATCH(TRUE,(AggSGID=$A6),0),28))),\"\",INDEX(AggSG,MATCH(TRUE,(AggSGID=$A6),0),28)))","v":""},{"$f":"IF($A6=\"\",\"\",IF(OR(ISNA(INDEX(AggSG,MATCH(TRUE,(AggSGID=$A6),0),26)),ISBLANK(INDEX(AggSG,MATCH(TRUE,(AggSGID=$A6),0),26))),\"\",INDEX(AggSG,MATCH(TRUE,(AggSGID=$A6),0),26)))","v":""},{"$f":"IF($A6=\"\",\"\",IF(OR(ISNA(INDEX(AggSG,MATCH(TRUE,(AggSGID=$A6),0),29)),ISBLANK(INDEX(AggSG,MATCH(TRUE,(AggSGID=$A6),0),29))),\"\",INDEX(AggSG,MATCH(TRUE,(AggSGID=$A6),0),29)))","v":""},{"$f":"IF($A6=\"\",\"\",IF(OR(ISNA(INDEX(AggCoreLok,MATCH(TRUE,(AggCoreLokID=$A6),0),14)),ISBLANK(INDEX(AggCoreLok,MATCH(TRUE,(AggCoreLokID=$A6),0),14))),\"\",INDEX(AggCoreLok,MATCH(TRUE,(AggCoreLokID=$A6),0),14)))","v":""},{"$f":"IF($A6=\"\",\"\",IF(OR(ISNA(INDEX(AggCoreLok,MATCH(TRUE,(AggCoreLokID=$A6),0),13)),ISBLANK(INDEX(AggCoreLok,MATCH(TRUE,(AggCoreLokID=$A6),0),13))),\"\",INDEX(AggCoreLok,MATCH(TRUE,(AggCoreLokID=$A6),0),13)))","v":""},{"$f":"IF($A6=\"\",\"\",IF(OR(ISNA(INDEX(AggCoreLok,MATCH(TRUE,(AggCoreLokID=$A6),0),15)),ISBLANK(INDEX(AggCoreLok,MATCH(TRUE,(AggCoreLokID=$A6),0),15))),\"\",INDEX(AggCoreLok,MATCH(TRUE,(AggCoreLokID=$A6),0),15)))","v":""},{"$f":"IF(E6=\"RAS\",2.6,IF(E6=\"RAP\",IF($A6=\"\",\"\",IF(OR(ISNA(INDEX(RAP_RAS!$I$15:$W$35,21,MATCH(TRUE,(RAP_RAS!$I$15:$W$15=$A6),0))),ISBLANK(INDEX(RAP_RAS!$I$15:$W$35,21,MATCH(TRUE,(RAP_RAS!$I$15:$W$15=$A6),0)))),\"\",INDEX(RAP_RAS!$I$15:$W$35,21,MATCH(TRUE,(RAP_RAS!$I$15:$W$15=$A6),0)))),\"\"))","v":""}]
[null,null,null,null,null,null,null,null,null,null,null,null,null,null,null,null,null,null,null,null,null,null,null,null,{"$f":"IF($AO7=\"\",IF(AL7=\"\",AI7,AL7),$AO7)","v":""},{"$f":"IF($AO7=\"\",IF(AM7=\"\",AJ7,AM7),$AO7)","v":""},{"$f":"IF($AO7=\"\",IF(AN7=\"\",AK7,AN7),\"\")","v":""},null,null,null,null,"1.5\"",null,"Minus",{"$f":"IF($A7=\"\",\"\",IF(OR(ISNA(INDEX(AggSG,MATCH(TRUE,(AggSGID=$A7),0),28)),ISBLANK(INDEX(AggSG,MATCH(TRUE,(AggSGID=$A7),0),28))),\"\",INDEX(AggSG,MATCH(TRUE,(AggSGID=$A7),0),28)))","v":""},{"$f":"IF($A7=\"\",\"\",IF(OR(ISNA(INDEX(AggSG,MATCH(TRUE,(AggSGID=$A7),0),26)),ISBLANK(INDEX(AggSG,MATCH(TRUE,(AggSGID=$A7),0),26))),\"\",INDEX(AggSG,MATCH(TRUE,(AggSGID=$A7),0),26)))","v":""},{"$f":"IF($A7=\"\",\"\",IF(OR(ISNA(INDEX(AggSG,MATCH(TRUE,(AggSGID=$A7),0),29)),ISBLANK(INDEX(AggSG,MATCH(TRUE,(AggSGID=$A7),0),29))),\"\",INDEX(AggSG,MATCH(TRUE,(AggSGID=$A7),0),29)))","v":""},{"$f":"IF($A7=\"\",\"\",IF(OR(ISNA(INDEX(AggCoreLok,MATCH(TRUE,(AggCoreLokID=$A7),0),14)),ISBLANK(INDEX(AggCoreLok,MATCH(TRUE,(AggCoreLokID=$A7),0),14))),\"\",INDEX(AggCoreLok,MATCH(TRUE,(AggCoreLokID=$A7),0),14)))","v":""},{"$f":"IF($A7=\"\",\"\",IF(OR(ISNA(INDEX(AggCoreLok,MATCH(TRUE,(AggCoreLokID=$A7),0),13)),ISBLANK(INDEX(AggCoreLok,MATCH(TRUE,(AggCoreLokID=$A7),0),13))),\"\",INDEX(AggCoreLok,MATCH(TRUE,(AggCoreLokID=$A7),0),13)))","v":""},{"$f":"IF($A7=\"\",\"\",IF(OR(ISNA(INDEX(AggCoreLok,MATCH(TRUE,(AggCoreLokID=$A7),0),15)),ISBLANK(INDEX(AggCoreLok,MATCH(TRUE,(AggCoreLokID=$A7),0),15))),\"\",INDEX(AggCoreLok,MATCH(TRUE,(AggCoreLokID=$A7),0),15)))","v":""},{"$f":"IF(E7=\"RAS\",2.6,IF(E7=\"RAP\",IF($A7=\"\",\"\",IF(OR(ISNA(INDEX(RAP_RAS!$I$15:$W$35,21,MATCH(TRUE,(RAP_RAS!$I$15:$W$15=$A7),0))),ISBLANK(INDEX(RAP_RAS!$I$15:$W$35,21,MATCH(TRUE,(RAP_RAS!$I$15:$W$15=$A7),0)))),\"\",INDEX(RAP_RAS!$I$15:$W$35,21,MATCH(TRUE,(RAP_RAS!$I$15:$W$15=$A7),0)))),\"\"))","v":""}]
[null,null,null,null,null,null,null,null,null,null,null,null,null,null,null,null,null,null,null,null,null,null,null,null,"","","",null,null,null,null,"1\"",null,"Chip",{"$f":"IF($A8=\"\",\"\",IF(OR(ISNA(INDEX(AggSG,MATCH(TRUE,(AggSGID=$A8),0),28)),ISBLANK(INDEX(AggSG,MATCH(TRUE,(AggSGID=$A8),0),28))),\"\",INDEX(AggSG,MATCH(TRUE,(AggSGID=$A8),0),28)))","v":""},{"$f":"IF($A8=\"\",\"\",IF(OR(ISNA(INDEX(AggSG,MATCH(TRUE,(AggSGID=$A8),0),26)),ISBLANK(INDEX(AggSG,MATCH(TRUE,(AggSGID=$A8),0),26))),\"\",INDEX(AggSG,MATCH(TRUE,(AggSGID=$A8),0),26)))","v":""},{"$f":"IF($A8=\"\",\"\",IF(OR(ISNA(INDEX(AggSG,MATCH(TRUE,(AggSGID=$A8),0),29)),ISBLANK(INDEX(AggSG,MATCH(TRUE,(AggSGID=$A8),0),29))),\"\",INDEX(AggSG,MATCH(TRUE,(AggSGID=$A8),0),29)))","v":""},{"$f":"IF($A8=\"\",\"\",IF(OR(ISNA(INDEX(AggCoreLok,MATCH(TRUE,(AggCoreLokID=$A8),0),14)),ISBLANK(INDEX(AggCoreLok,MATCH(TRUE,(AggCoreLokID=$A8),0),14))),\"\",INDEX(AggCoreLok,MATCH(TRUE,(AggCoreLokID=$A8),0),14)))","v":""},{"$f":"IF($A8=\"\",\"\",IF(OR(ISNA(INDEX(AggCoreLok,MATCH(TRUE,(AggCoreLokID=$A8),0),13)),ISBLANK(INDEX(AggCoreLok,MATCH(TRUE,(AggCoreLokID=$A8),0),13))),\"\",INDEX(AggCoreLok,MATCH(TRUE,(AggCoreLokID=$A8),0),13)))","v":""},{"$f":"IF($A8=\"\",\"\",IF(OR(ISNA(INDEX(AggCoreLok,MATCH(TRUE,(AggCoreLokID=$A8),0),15)),ISBLANK(INDEX(AggCoreLok,MATCH(TRUE,(AggCoreLokID=$A8),0),15))),\"\",INDEX(AggCoreLok,MATCH(TRUE,(AggCoreLokID=$A8),0),15)))","v":""},{"$f":"IF(E8=\"RAS\",2.6,IF(E8=\"RAP\",IF($A8=\"\",\"\",IF(OR(ISNA(INDEX(RAP_RAS!$I$15:$W$35,21,MATCH(TRUE,(RAP_RAS!$I$15:$W$15=$A8),0))),ISBLANK(INDEX(RAP_RAS!$I$15:$W$35,21,MATCH(TRUE,(RAP_RAS!$I$15:$W$15=$A8),0)))),\"\",INDEX(RAP_RAS!$I$15:$W$35,21,MATCH(TRUE,(RAP_RAS!$I$15:$W$15=$A8),0)))),\"\"))","v":""}]
[null,null,null,null,null,null,null,null,null,null,null,null,null,null,null,null,null,null,null,null,null,null,null,null,"","","",null,null,null,null,"3/4\"",null,"Scrng.",{"$f":"IF($A9=\"\",\"\",IF(OR(ISNA(INDEX(AggSG,MATCH(TRUE,(AggSGID=$A9),0),28)),ISBLANK(INDEX(AggSG,MATCH(TRUE,(AggSGID=$A9),0),28))),\"\",INDEX(AggSG,MATCH(TRUE,(AggSGID=$A9),0),28)))","v":""},{"$f":"IF($A9=\"\",\"\",IF(OR(ISNA(INDEX(AggSG,MATCH(TRUE,(AggSGID=$A9),0),26)),ISBLANK(INDEX(AggSG,MATCH(TRUE,(AggSGID=$A9),0),26))),\"\",INDEX(AggSG,MATCH(TRUE,(AggSGID=$A9),0),26)))","v":""},{"$f":"IF($A9=\"\",\"\",IF(OR(ISNA(INDEX(AggSG,MATCH(TRUE,(AggSGID=$A9),0),29)),ISBLANK(INDEX(AggSG,MATCH(TRUE,(AggSGID=$A9),0),29))),\"\",INDEX(AggSG,MATCH(TRUE,(AggSGID=$A9),0),29)))","v":""},{"$f":"IF($A9=\"\",\"\",IF(OR(ISNA(INDEX(AggCoreLok,MATCH(TRUE,(AggCoreLokID=$A9),0),14)),ISBLANK(INDEX(AggCoreLok,MATCH(TRUE,(AggCoreLokID=$A9),0),14))),\"\",INDEX(AggCoreLok,MATCH(TRUE,(AggCoreLokID=$A9),0),14)))","v":""},{"$f":"IF($A9=\"\",\"\",IF(OR(ISNA(INDEX(AggCoreLok,MATCH(TRUE,(AggCoreLokID=$A9),0),13)),ISBLANK(INDEX(AggCoreLok,MATCH(TRUE,(AggCoreLokID=$A9),0),13))),\"\",INDEX(AggCoreLok,MATCH(TRUE,(AggCoreLokID=$A9),0),13)))","v":""},{"$f":"IF($A9=\"\",\"\",IF(OR(ISNA(INDEX(AggCoreLok,MATCH(TRUE,(AggCoreLokID=$A9),0),15)),ISBLANK(INDEX(AggCoreLok,MATCH(TRUE,(AggCoreLokID=$A9),0),15))),\"\",INDEX(AggCoreLok,MATCH(TRUE,(AggCoreLokID=$A9),0),15)))","v":""},{"$f":"IF(E9=\"RAS\",2.6,IF(E9=\"RAP\",IF($A9=\"\",\"\",IF(OR(ISNA(INDEX(RAP_RAS!$I$15:$W$35,21,MATCH(TRUE,(RAP_RAS!$I$15:$W$15=$A9),0))),ISBLANK(INDEX(RAP_RAS!$I$15:$W$35,21,MATCH(TRUE,(RAP_RAS!$I$15:$W$15=$A9),0)))),\"\",INDEX(RAP_RAS!$I$15:$W$35,21,MATCH(TRUE,(RAP_RAS!$I$15:$W$15=$A9),0)))),\"\"))","v":""}]
[null,null,null,null,null,null,null,null,null,null,null,null,null,null,null,null,null,null,null,null,null,null,null,null,"","","",null,null,null,null,"1/2\"",null,"Sand",{"$f":"IF($A10=\"\",\"\",IF(OR(ISNA(INDEX(AggSG,MATCH(TRUE,(AggSGID=$A10),0),28)),ISBLANK(INDEX(AggSG,MATCH(TRUE,(AggSGID=$A10),0),28))),\"\",INDEX(AggSG,MATCH(TRUE,(AggSGID=$A10),0),28)))","v":""},{"$f":"IF($A10=\"\",\"\",IF(OR(ISNA(INDEX(AggSG,MATCH(TRUE,(AggSGID=$A10),0),26)),ISBLANK(INDEX(AggSG,MATCH(TRUE,(AggSGID=$A10),0),26))),\"\",INDEX(AggSG,MATCH(TRUE,(AggSGID=$A10),0),26)))","v":""},{"$f":"IF($A10=\"\",\"\",IF(OR(ISNA(INDEX(AggSG,MATCH(TRUE,(AggSGID=$A10),0),29)),ISBLANK(INDEX(AggSG,MATCH(TRUE,(AggSGID=$A10),0),29))),\"\",INDEX(AggSG,MATCH(TRUE,(AggSGID=$A10),0),29)))","v":""},{"$f":"IF($A10=\"\",\"\",IF(OR(ISNA(INDEX(AggCoreLok,MATCH(TRUE,(AggCoreLokID=$A10),0),14)),ISBLANK(INDEX(AggCoreLok,MATCH(TRUE,(AggCoreLokID=$A10),0),14))),\"\",INDEX(AggCoreLok,MATCH(TRUE,(AggCoreLokID=$A10),0),14)))","v":""},{"$f":"IF($A10=\"\",\"\",IF(OR(ISNA(INDEX(AggCoreLok,MATCH(TRUE,(AggCoreLokID=$A10),0),13)),ISBLANK(INDEX(AggCoreLok,MATCH(TRUE,(AggCoreLokID=$A10),0),13))),\"\",INDEX(AggCoreLok,MATCH(TRUE,(AggCoreLokID=$A10),0),13)))","v":""},{"$f":"IF($A10=\"\",\"\",IF(OR(ISNA(INDEX(AggCoreLok,MATCH(TRUE,(AggCoreLokID=$A10),0),15)),ISBLANK(INDEX(AggCoreLok,MATCH(TRUE,(AggCoreLokID=$A10),0),15))),\"\",INDEX(AggCoreLok,MATCH(TRUE,(AggCoreLokID=$A10),0),15)))","v":""},{"$f":"IF(E10=\"RAS\",2.6,IF(E10=\"RAP\",IF($A10=\"\",\"\",IF(OR(ISNA(INDEX(RAP_RAS!$I$15:$W$35,21,MATCH(TRUE,(RAP_RAS!$I$15:$W$15=$A10),0))),ISBLANK(INDEX(RAP_RAS!$I$15:$W$35,21,MATCH(TRUE,(RAP_RAS!$I$15:$W$15=$A10),0)))),\"\",INDEX(RAP_RAS!$I$15:$W$35,21,MATCH(TRUE,(RAP_RAS!$I$15:$W$15=$A10),0)))),\"\"))","v":""}]
[null,null,null,null,null,null,null,null,null,null,null,null,null,null,null,null,null,null,null,null,null,null,null,null,"","","",null,null,null,null,"3/8\"",null,null,{"$f":"IF($A11=\"\",\"\",IF(OR(ISNA(INDEX(AggSG,MATCH(TRUE,(AggSGID=$A11),0),28)),ISBLANK(INDEX(AggSG,MATCH(TRUE,(AggSGID=$A11),0),28))),\"\",INDEX(AggSG,MATCH(TRUE,(AggSGID=$A11),0),28)))","v":""},{"$f":"IF($A11=\"\",\"\",IF(OR(ISNA(INDEX(AggSG,MATCH(TRUE,(AggSGID=$A11),0),26)),ISBLANK(INDEX(AggSG,MATCH(TRUE,(AggSGID=$A11),0),26))),\"\",INDEX(AggSG,MATCH(TRUE,(AggSGID=$A11),0),26)))","v":""},{"$f":"IF($A11=\"\",\"\",IF(OR(ISNA(INDEX(AggSG,MATCH(TRUE,(AggSGID=$A11),0),29)),ISBLANK(INDEX(AggSG,MATCH(TRUE,(AggSGID=$A11),0),29))),\"\",INDEX(AggSG,MATCH(TRUE,(AggSGID=$A11),0),29)))","v":""},{"$f":"IF($A11=\"\",\"\",IF(OR(ISNA(INDEX(AggCoreLok,MATCH(TRUE,(AggCoreLokID=$A11),0),14)),ISBLANK(INDEX(AggCoreLok,MATCH(TRUE,(AggCoreLokID=$A11),0),14))),\"\",INDEX(AggCoreLok,MATCH(TRUE,(AggCoreLokID=$A11),0),14)))","v":""},{"$f":"IF($A11=\"\",\"\",IF(OR(ISNA(INDEX(AggCoreLok,MATCH(TRUE,(AggCoreLokID=$A11),0),13)),ISBLANK(INDEX(AggCoreLok,MATCH(TRUE,(AggCoreLokID=$A11),0),13))),\"\",INDEX(AggCoreLok,MATCH(TRUE,(AggCoreLokID=$A11),0),13)))","v":""},{"$f":"IF($A11=\"\",\"\",IF(OR(ISNA(INDEX(AggCoreLok,MATCH(TRUE,(AggCoreLokID=$A11),0),15)),ISBLANK(INDEX(AggCoreLok,MATCH(TRUE,(AggCoreLokID=$A11),0),15))),\"\",INDEX(AggCoreLok,MATCH(TRUE,(AggCoreLokID=$A11),0),15)))","v":""},{"$f":"IF(E11=\"RAS\",2.6,IF(E11=\"RAP\",IF($A11=\"\",\"\",IF(OR(ISNA(INDEX(RAP_RAS!$I$15:$W$35,21,MATCH(TRUE,(RAP_RAS!$I$15:$W$15=$A11),0))),ISBLANK(INDEX(RAP_RAS!$I$15:$W$35,21,MATCH(TRUE,(RAP_RAS!$I$15:$W$15=$A11),0)))),\"\",INDEX(RAP_RAS!$I$15:$W$35,21,MATCH(TRUE,(RAP_RAS!$I$15:$W$15=$A11),0)))),\"\"))","v":""}]
[null,null,null,null,null,null,null,null,null,null,null,null,null,null,null,null,null,null,null,null,null,null,null,null,"","","",null,null,null,null,"1/4\"",null,null,{"$f":"IF($A12=\"\",\"\",IF(OR(ISNA(INDEX(AggSG,MATCH(TRUE,(AggSGID=$A12),0),28)),ISBLANK(INDEX(AggSG,MATCH(TRUE,(AggSGID=$A12),0),28))),\"\",INDEX(AggSG,MATCH(TRUE,(AggSGID=$A12),0),28)))","v":""},{"$f":"IF($A12=\"\",\"\",IF(OR(ISNA(INDEX(AggSG,MATCH(TRUE,(AggSGID=$A12),0),26)),ISBLANK(INDEX(AggSG,MATCH(TRUE,(AggSGID=$A12),0),26))),\"\",INDEX(AggSG,MATCH(TRUE,(AggSGID=$A12),0),26)))","v":""},{"$f":"IF($A12=\"\",\"\",IF(OR(ISNA(INDEX(AggSG,MATCH(TRUE,(AggSGID=$A12),0),29)),ISBLANK(INDEX(AggSG,MATCH(TRUE,(AggSGID=$A12),0),29))),\"\",INDEX(AggSG,MATCH(TRUE,(AggSGID=$A12),0),29)))","v":""},{"$f":"IF($A12=\"\",\"\",IF(OR(ISNA(INDEX(AggCoreLok,MATCH(TRUE,(AggCoreLokID=$A12),0),14)),ISBLANK(INDEX(AggCoreLok,MATCH(TRUE,(AggCoreLokID=$A12),0),14))),\"\",INDEX(AggCoreLok,MATCH(TRUE,(AggCoreLokID=$A12),0),14)))","v":""},{"$f":"IF($A12=\"\",\"\",IF(OR(ISNA(INDEX(AggCoreLok,MATCH(TRUE,(AggCoreLokID=$A12),0),13)),ISBLANK(INDEX(AggCoreLok,MATCH(TRUE,(AggCoreLokID=$A12),0),13))),\"\",INDEX(AggCoreLok,MATCH(TRUE,(AggCoreLokID=$A12),0),13)))","v":""},{"$f":"IF($A12=\"\",\"\",IF(OR(ISNA(INDEX(AggCoreLok,MATCH(TRUE,(AggCoreLokID=$A12),0),15)),ISBLANK(INDEX(AggCoreLok,MATCH(TRUE,(AggCoreLokID=$A12),0),15))),\"\",INDEX(AggCoreLok,MATCH(TRUE,(AggCoreLokID=$A12),0),15)))","v":""},{"$f":"IF(E12=\"RAS\",2.6,IF(E12=\"RAP\",IF($A12=\"\",\"\",IF(OR(ISNA(INDEX(RAP_RAS!$I$15:$W$35,21,MATCH(TRUE,(RAP_RAS!$I$15:$W$15=$A12),0))),ISBLANK(INDEX(RAP_RAS!$I$15:$W$35,21,MATCH(TRUE,(RAP_RAS!$I$15:$W$15=$A12),0)))),\"\",INDEX(RAP_RAS!$I$15:$W$35,21,MATCH(TRUE,(RAP_RAS!$I$15:$W$15=$A12),0)))),\"\"))","v":""}]
[null,null,null,null,null,null,null,null,null,null,null,null,null,null,null,null,null,null,null,null,null,null,null,null,"","","",null,null,null,null,"NS",null,null,{"$f":"IF($A13=\"\",\"\",IF(OR(ISNA(INDEX(AggSG,MATCH(TRUE,(AggSGID=$A13),0),28)),ISBLANK(INDEX(AggSG,MATCH(TRUE,(AggSGID=$A13),0),28))),\"\",INDEX(AggSG,MATCH(TRUE,(AggSGID=$A13),0),28)))","v":""},{"$f":"IF($A13=\"\",\"\",IF(OR(ISNA(INDEX(AggSG,MATCH(TRUE,(AggSGID=$A13),0),26)),ISBLANK(INDEX(AggSG,MATCH(TRUE,(AggSGID=$A13),0),26))),\"\",INDEX(AggSG,MATCH(TRUE,(AggSGID=$A13),0),26)))","v":""},{"$f":"IF($A13=\"\",\"\",IF(OR(ISNA(INDEX(AggSG,MATCH(TRUE,(AggSGID=$A13),0),29)),ISBLANK(INDEX(AggSG,MATCH(TRUE,(AggSGID=$A13),0),29))),\"\",INDEX(AggSG,MATCH(TRUE,(AggSGID=$A13),0),29)))","v":""},{"$f":"IF($A13=\"\",\"\",IF(OR(ISNA(INDEX(AggCoreLok,MATCH(TRUE,(AggCoreLokID=$A13),0),14)),ISBLANK(INDEX(AggCoreLok,MATCH(TRUE,(AggCoreLokID=$A13),0),14))),\"\",INDEX(AggCoreLok,MATCH(TRUE,(AggCoreLokID=$A13),0),14)))","v":""},{"$f":"IF($A13=\"\",\"\",IF(OR(ISNA(INDEX(AggCoreLok,MATCH(TRUE,(AggCoreLokID=$A13),0),13)),ISBLANK(INDEX(AggCoreLok,MATCH(TRUE,(AggCoreLokID=$A13),0),13))),\"\",INDEX(AggCoreLok,MATCH(TRUE,(AggCoreLokID=$A13),0),13)))","v":""},{"$f":"IF($A13=\"\",\"\",IF(OR(ISNA(INDEX(AggCoreLok,MATCH(TRUE,(AggCoreLokID=$A13),0),15)),ISBLANK(INDEX(AggCoreLok,MATCH(TRUE,(AggCoreLokID=$A13),0),15))),\"\",INDEX(AggCoreLok,MATCH(TRUE,(AggCoreLokID=$A13),0),15)))","v":""},{"$f":"IF(E13=\"RAS\",2.6,IF(E13=\"RAP\",IF($A13=\"\",\"\",IF(OR(ISNA(INDEX(RAP_RAS!$I$15:$W$35,21,MATCH(TRUE,(RAP_RAS!$I$15:$W$15=$A13),0))),ISBLANK(INDEX(RAP_RAS!$I$15:$W$35,21,MATCH(TRUE,(RAP_RAS!$I$15:$W$15=$A13),0)))),\"\",INDEX(RAP_RAS!$I$15:$W$35,21,MATCH(TRUE,(RAP_RAS!$I$15:$W$15=$A13),0)))),\"\"))","v":""}]
[null,null,null,null,null,null,null,null,null,null,null,null,null,null,null,null,null,null,null,null,null,null,null,null,"","","",null,null,null,null,"MS",null,null,{"$f":"IF($A14=\"\",\"\",IF(OR(ISNA(INDEX(AggSG,MATCH(TRUE,(AggSGID=$A14),0),28)),ISBLANK(INDEX(AggSG,MATCH(TRUE,(AggSGID=$A14),0),28))),\"\",INDEX(AggSG,MATCH(TRUE,(AggSGID=$A14),0),28)))","v":""},{"$f":"IF($A14=\"\",\"\",IF(OR(ISNA(INDEX(AggSG,MATCH(TRUE,(AggSGID=$A14),0),26)),ISBLANK(INDEX(AggSG,MATCH(TRUE,(AggSGID=$A14),0),26))),\"\",INDEX(AggSG,MATCH(TRUE,(AggSGID=$A14),0),26)))","v":""},{"$f":"IF($A14=\"\",\"\",IF(OR(ISNA(INDEX(AggSG,MATCH(TRUE,(AggSGID=$A14),0),29)),ISBLANK(INDEX(AggSG,MATCH(TRUE,(AggSGID=$A14),0),29))),\"\",INDEX(AggSG,MATCH(TRUE,(AggSGID=$A14),0),29)))","v":""},{"$f":"IF($A14=\"\",\"\",IF(OR(ISNA(INDEX(AggCoreLok,MATCH(TRUE,(AggCoreLokID=$A14),0),14)),ISBLANK(INDEX(AggCoreLok,MATCH(TRUE,(AggCoreLokID=$A14),0),14))),\"\",INDEX(AggCoreLok,MATCH(TRUE,(AggCoreLokID=$A14),0),14)))","v":""},{"$f":"IF($A14=\"\",\"\",IF(OR(ISNA(INDEX(AggCoreLok,MATCH(TRUE,(AggCoreLokID=$A14),0),13)),ISBLANK(INDEX(AggCoreLok,MATCH(TRUE,(AggCoreLokID=$A14),0),13))),\"\",INDEX(AggCoreLok,MATCH(TRUE,(AggCoreLokID=$A14),0),13)))","v":""},{"$f":"IF($A14=\"\",\"\",IF(OR(ISNA(INDEX(AggCoreLok,MATCH(TRUE,(AggCoreLokID=$A14),0),15)),ISBLANK(INDEX(AggCoreLok,MATCH(TRUE,(AggCoreLokID=$A14),0),15))),\"\",INDEX(AggCoreLok,MATCH(TRUE,(AggCoreLokID=$A14),0),15)))","v":""},{"$f":"IF(E14=\"RAS\",2.6,IF(E14=\"RAP\",IF($A14=\"\",\"\",IF(OR(ISNA(INDEX(RAP_RAS!$I$15:$W$35,21,MATCH(TRUE,(RAP_RAS!$I$15:$W$15=$A14),0))),ISBLANK(INDEX(RAP_RAS!$I$15:$W$35,21,MATCH(TRUE,(RAP_RAS!$I$15:$W$15=$A14),0)))),\"\",INDEX(RAP_RAS!$I$15:$W$35,21,MATCH(TRUE,(RAP_RAS!$I$15:$W$15=$A14),0)))),\"\"))","v":""}]
[null,null,null,null,null,null,null,null,null,null,null,null,null,null,null,null,null,null,null,null,null,null,null,null,"","","",null,null,null,null,"Scrg",null,null,{"$f":"IF($A15=\"\",\"\",IF(OR(ISNA(INDEX(AggSG,MATCH(TRUE,(AggSGID=$A15),0),28)),ISBLANK(INDEX(AggSG,MATCH(TRUE,(AggSGID=$A15),0),28))),\"\",INDEX(AggSG,MATCH(TRUE,(AggSGID=$A15),0),28)))","v":""},{"$f":"IF($A15=\"\",\"\",IF(OR(ISNA(INDEX(AggSG,MATCH(TRUE,(AggSGID=$A15),0),26)),ISBLANK(INDEX(AggSG,MATCH(TRUE,(AggSGID=$A15),0),26))),\"\",INDEX(AggSG,MATCH(TRUE,(AggSGID=$A15),0),26)))","v":""},{"$f":"IF($A15=\"\",\"\",IF(OR(ISNA(INDEX(AggSG,MATCH(TRUE,(AggSGID=$A15),0),29)),ISBLANK(INDEX(AggSG,MATCH(TRUE,(AggSGID=$A15),0),29))),\"\",INDEX(AggSG,MATCH(TRUE,(AggSGID=$A15),0),29)))","v":""},{"$f":"IF($A15=\"\",\"\",IF(OR(ISNA(INDEX(AggCoreLok,MATCH(TRUE,(AggCoreLokID=$A15),0),14)),ISBLANK(INDEX(AggCoreLok,MATCH(TRUE,(AggCoreLokID=$A15),0),14))),\"\",INDEX(AggCoreLok,MATCH(TRUE,(AggCoreLokID=$A15),0),14)))","v":""},{"$f":"IF($A15=\"\",\"\",IF(OR(ISNA(INDEX(AggCoreLok,MATCH(TRUE,(AggCoreLokID=$A15),0),13)),ISBLANK(INDEX(AggCoreLok,MATCH(TRUE,(AggCoreLokID=$A15),0),13))),\"\",INDEX(AggCoreLok,MATCH(TRUE,(AggCoreLokID=$A15),0),13)))","v":""},{"$f":"IF($A15=\"\",\"\",IF(OR(ISNA(INDEX(AggCoreLok,MATCH(TRUE,(AggCoreLokID=$A15),0),15)),ISBLANK(INDEX(AggCoreLok,MATCH(TRUE,(AggCoreLokID=$A15),0),15))),\"\",INDEX(AggCoreLok,MATCH(TRUE,(AggCoreLokID=$A15),0),15)))","v":""},{"$f":"IF(E15=\"RAS\",2.6,IF(E15=\"RAP\",IF($A15=\"\",\"\",IF(OR(ISNA(INDEX(RAP_RAS!$I$15:$W$35,21,MATCH(TRUE,(RAP_RAS!$I$15:$W$15=$A15),0))),ISBLANK(INDEX(RAP_RAS!$I$15:$W$35,21,MATCH(TRUE,(RAP_RAS!$I$15:$W$15=$A15),0)))),\"\",INDEX(RAP_RAS!$I$15:$W$35,21,MATCH(TRUE,(RAP_RAS!$I$15:$W$15=$A15),0)))),\"\"))","v":""}]
[null,null,null,null,null,null,null,null,null,null,null,null,null,null,null,null,null,null,null,null,null,null,null,null,"","","",null,null,null,null,null,null,null,{"$f":"IF($A16=\"\",\"\",IF(OR(ISNA(INDEX(AggSG,MATCH(TRUE,(AggSGID=$A16),0),28)),ISBLANK(INDEX(AggSG,MATCH(TRUE,(AggSGID=$A16),0),28))),\"\",INDEX(AggSG,MATCH(TRUE,(AggSGID=$A16),0),28)))","v":""},{"$f":"IF($A16=\"\",\"\",IF(OR(ISNA(INDEX(AggSG,MATCH(TRUE,(AggSGID=$A16),0),26)),ISBLANK(INDEX(AggSG,MATCH(TRUE,(AggSGID=$A16),0),26))),\"\",INDEX(AggSG,MATCH(TRUE,(AggSGID=$A16),0),26)))","v":""},{"$f":"IF($A16=\"\",\"\",IF(OR(ISNA(INDEX(AggSG,MATCH(TRUE,(AggSGID=$A16),0),29)),ISBLANK(INDEX(AggSG,MATCH(TRUE,(AggSGID=$A16),0),29))),\"\",INDEX(AggSG,MATCH(TRUE,(AggSGID=$A16),0),29)))","v":""},{"$f":"IF($A16=\"\",\"\",IF(OR(ISNA(INDEX(AggCoreLok,MATCH(TRUE,(AggCoreLokID=$A16),0),14)),ISBLANK(INDEX(AggCoreLok,MATCH(TRUE,(AggCoreLokID=$A16),0),14))),\"\",INDEX(AggCoreLok,MATCH(TRUE,(AggCoreLokID=$A16),0),14)))","v":""},{"$f":"IF($A16=\"\",\"\",IF(OR(ISNA(INDEX(AggCoreLok,MATCH(TRUE,(AggCoreLokID=$A16),0),13)),ISBLANK(INDEX(AggCoreLok,MATCH(TRUE,(AggCoreLokID=$A16),0),13))),\"\",INDEX(AggCoreLok,MATCH(TRUE,(AggCoreLokID=$A16),0),13)))","v":""},{"$f":"IF($A16=\"\",\"\",IF(OR(ISNA(INDEX(AggCoreLok,MATCH(TRUE,(AggCoreLokID=$A16),0),15)),ISBLANK(INDEX(AggCoreLok,MATCH(TRUE,(AggCoreLokID=$A16),0),15))),\"\",INDEX(AggCoreLok,MATCH(TRUE,(AggCoreLokID=$A16),0),15)))","v":""},{"$f":"IF(E16=\"RAS\",2.6,IF(E16=\"RAP\",IF($A16=\"\",\"\",IF(OR(ISNA(INDEX(RAP_RAS!$I$15:$W$35,21,MATCH(TRUE,(RAP_RAS!$I$15:$W$15=$A16),0))),ISBLANK(INDEX(RAP_RAS!$I$15:$W$35,21,MATCH(TRUE,(RAP_RAS!$I$15:$W$15=$A16),0)))),\"\",INDEX(RAP_RAS!$I$15:$W$35,21,MATCH(TRUE,(RAP_RAS!$I$15:$W$15=$A16),0)))),\"\"))","v":""}]
[null,null,null,null,null,null,null,null,null,null,null,null,null,null,null,null,null,null,null,null,null,null,null,null,"","","",null,null,null,null,null,null,null,{"$f":"IF($A17=\"\",\"\",IF(OR(ISNA(INDEX(AggSG,MATCH(TRUE,(AggSGID=$A17),0),28)),ISBLANK(INDEX(AggSG,MATCH(TRUE,(AggSGID=$A17),0),28))),\"\",INDEX(AggSG,MATCH(TRUE,(AggSGID=$A17),0),28)))","v":""},{"$f":"IF($A17=\"\",\"\",IF(OR(ISNA(INDEX(AggSG,MATCH(TRUE,(AggSGID=$A17),0),26)),ISBLANK(INDEX(AggSG,MATCH(TRUE,(AggSGID=$A17),0),26))),\"\",INDEX(AggSG,MATCH(TRUE,(AggSGID=$A17),0),26)))","v":""},{"$f":"IF($A17=\"\",\"\",IF(OR(ISNA(INDEX(AggSG,MATCH(TRUE,(AggSGID=$A17),0),29)),ISBLANK(INDEX(AggSG,MATCH(TRUE,(AggSGID=$A17),0),29))),\"\",INDEX(AggSG,MATCH(TRUE,(AggSGID=$A17),0),29)))","v":""},{"$f":"IF($A17=\"\",\"\",IF(OR(ISNA(INDEX(AggCoreLok,MATCH(TRUE,(AggCoreLokID=$A17),0),14)),ISBLANK(INDEX(AggCoreLok,MATCH(TRUE,(AggCoreLokID=$A17),0),14))),\"\",INDEX(AggCoreLok,MATCH(TRUE,(AggCoreLokID=$A17),0),14)))","v":""},{"$f":"IF($A17=\"\",\"\",IF(OR(ISNA(INDEX(AggCoreLok,MATCH(TRUE,(AggCoreLokID=$A17),0),13)),ISBLANK(INDEX(AggCoreLok,MATCH(TRUE,(AggCoreLokID=$A17),0),13))),\"\",INDEX(AggCoreLok,MATCH(TRUE,(AggCoreLokID=$A17),0),13)))","v":""},{"$f":"IF($A17=\"\",\"\",IF(OR(ISNA(INDEX(AggCoreLok,MATCH(TRUE,(AggCoreLokID=$A17),0),15)),ISBLANK(INDEX(AggCoreLok,MATCH(TRUE,(AggCoreLokID=$A17),0),15))),\"\",INDEX(AggCoreLok,MATCH(TRUE,(AggCoreLokID=$A17),0),15)))","v":""},{"$f":"IF(E17=\"RAS\",2.6,IF(E17=\"RAP\",IF($A17=\"\",\"\",IF(OR(ISNA(INDEX(RAP_RAS!$I$15:$W$35,21,MATCH(TRUE,(RAP_RAS!$I$15:$W$15=$A17),0))),ISBLANK(INDEX(RAP_RAS!$I$15:$W$35,21,MATCH(TRUE,(RAP_RAS!$I$15:$W$15=$A17),0)))),\"\",INDEX(RAP_RAS!$I$15:$W$35,21,MATCH(TRUE,(RAP_RAS!$I$15:$W$15=$A17),0)))),\"\"))","v":""}]

{"sheet":"Additives","index":2,"n_rows":42,"n_cols":28,"rows_kept":42,"cut":false,"hidden":false,"merged":[]}
[null,null,"Enter Data for Additives Including Mineral Fillers, Binder Additives and Fibers"]
[]
[]
[null,null,null,null,null,null,"ADDED BY","BAGHOUSE",null,null,null,null,null,null,null,null,null,null,null,null,null,null,"COMPONENT","COMPONENT"]
["MATERIAL ID","PLANT ↓","SUPPLIER","LOCATION","BRAND NAME","TYPE ↓","WEIGHT OF ↓","Y/N","2\"","1 1/2\"","1\"","3/4\"","1/2\"","3/8\"","No.4","No.8","No.16","No.30","No.50","No.100","No.200","Gsb","COST","UNIT"]
["16NWMAT004",null,"KEREFORD LIMESTONE CO.","WEEPING WATER, NE",null,"Mineral Filler","Aggregate","Y",100,100,100,100,100,100,100,100,100,100,null,null,null,null,null,"Tons",null,"Mineral Filler",null,"Aggregate"]
["16SWASM006",null,"CITY UTILITIES, SOUTHWEST PLANT","SPRINGFIELD, MO",null,"Fly Ash","Aggregate","N",100,100,100,100,100,100,100,100,100,100,null,null,null,null,null,"Tons",null,"Fly Ash",null,"Mixture"]
["16SWASM007",null,"CITY UTILITIES, JAMES RIVER POWER","SPRINGFIELD, MO",null,"Fly Ash","Aggregate",null,100,100,100,100,100,100,100,100,100,100,null,null,null,null,null,"Tons",null,"Cement Kiln Dust",null,"Binder"]
["16SWD3B005",null,"Headwaters Resources","SPRINGFIELD, MO",null,"Fly Ash","Aggregate",null,100,100,100,100,100,100,100,100,100,100,null,null,null,null,null,"Tons",null,"Baghouse Fines",null,"Recycle"]
["16SEMA0011",null,"MISSISSIPPI LIME CO. #2","STE. GENEVIEVE, MO",null,"Mineral Filler","Aggregate",null,100,100,100,100,100,100,100,100,100,100,99.5,99.5,99,2.72,null,"Gal",null,"Hydrated Lime",null,"GTR"]
["16SEMA0012",null,"MISSISSIPPI LIME CO. #2","STE. GENEVIEVE, MO",null,"Hydrated Lime","Aggregate",null,100,100,100,100,100,100,100,100,100,null,null,null,null,null,null,"Gal",null,"Cement Kiln Dust"]
["15MFO0087",null,"ARR MAZ CUSTOM CHEMICALS","MULBERRY, FL","AD-HERE HP PLUS","Anti-Strip","Binder",null,null,null,null,null,null,null,null,null,null,null,null,null,null,null,null,"Lbs",null,"Mineral Fibers"]
["15MFO0088",null,"ARR MAZ CUSTOM CHEMICALS","MULBERRY, FL","AD-HERE 77-00 LS","Anti-Strip","Binder",null,null,null,null,null,null,null,null,null,null,null,null,null,null,null,null,"Lbs",null,"Cellulose Fibers",null,"Lbs"]
["15MFO0089",null,"ARR MAZ CUSTOM CHEMICALS","MULBERRY, FL","AD-HERE 65-00","Anti-Strip","Binder",null,null,null,null,null,null,null,null,null,null,null,null,null,null,null,null,"Lbs",null,"Anti-Strip",null,"Tons"]
["15MFO0090",null,"ARR MAZ CUSTOM CHEMICALS","MULBERRY, FL","AD-HERE 65-00LS1","Anti-Strip","Binder",null,null,null,null,null,null,null,null,null,null,null,null,null,null,null,null,"Lbs",null,"Warm Mix",null,"Gal"]
["15MFO0091",null,"ARR MAZ CUSTOM CHEMICALS","MULBERRY, FL","AD-HERE LOF 65-00 EU","Anti-Strip","Binder",null,null,null,null,null,null,null,null,null,null,null,null,null,null,null,null,"Lbs",null,"GTR"]
["15MFO0074",null,"PRE TECH INDUSTRIES","NEW CASTLE, NH","PAVEGRIP 550","Anti-Strip","Binder",null,null,null,null,null,null,null,null,null,null,null,null,null,null,null,null,"Gal",null,"TOR"]
["16MNP16003",null,"CARGILL","PLYMOUTH, MN","ANOVA 1400","Anti-Strip","Binder",null,null,null,null,null,null,null,null,null,null,null,null,null,null,null,null,"Lbs",null,"Softener"]
[null,null,"INNOPHOS, INC.","CRANBURY, NJ","INNOVALT W","Anti-Strip","Binder",null,null,null,null,null,null,null,null,null,null,null,null,null,null,null,null,"Lbs"]
["15MNP15008",null,"MEADWESTVACO CORP.","CHARLESTON, SC","EVOTHERM J12","Anti-Strip","Binder"]
["16MFO0016",null,"MEADWESTVACO CORP.","CHARLESTON, SC","EVOTHERM M1","Anti-Strip","Binder"]
["16MFO0017",null,"MEADWESTVACO CORP.","CHARLESTON, SC","EVOTHERM M14","Anti-Strip","Binder"]
["15MFO0066",null,"MEADWESTVACO CORP.","CHARLESTON, SC","EVOTHERM S1","Anti-Strip","Binder"]
[null,null,"MEADWESTVACO CORP.","CHARLESTON, SC","EVOTHERM U1","Anti-Strip","Binder"]
["16MFO0018",null,"MEADWESTVACO CORP.","CHARLESTON, SC","MORLIFE T280","Anti-Strip","Binder"]
["16MFO0019",null,"MEADWESTVACO CORP.","CHARLESTON, SC","MORLIFE 5000","Anti-Strip","Binder"]
["16MFO0020",null,"MEADWESTVACO CORP.","CHARLESTON, SC","PAVE BOND LITE","Anti-Strip","Binder"]
["15MFO0069",null,"MEADWESTVACO CORP.","CHARLESTON, SC","EVOTHERM J1","Warm Mix","Binder"]
["15MNP15007",null,"MEADWESTVACO CORP.","CHARLESTON, SC","EVOTHERM J12","Warm Mix","Binder"]
["16MFO0021",null,"MEADWESTVACO CORP.","CHARLESTON, SC","EVOTHERM M1","Warm Mix","Binder"]
["16MFO0022",null,"MEADWESTVACO CORP.","CHARLESTON, SC","EVOTHERM M14","Warm Mix","Binder"]
["15MFO0073",null,"MEADWESTVACO CORP.","CHARLESTON, SC","EVOTHERM S1","Warm Mix","Binder"]
[null,null,"MEADWESTVACO CORP.","CHARLESTON, SC","EVOTHERM U1","Warm Mix","Binder"]
[null,null,"PVS MERIDIAN CHEMICALS, INC.","THE WOODLANDS, TX","HYDROGREEN","Softener","Binder"]
["16MFO0023",null,"MEADWESTVACO CORP.","CHARLESTON, SC","EVOFLEX CA","Softener","Binder"]
["16MFO0001",null,"DEGUSSA CORP.","PARSIPPANY, NJ","VESTENAMER","TOR","GTR"]
["16MFO0002",null,"LEHIGH TECHNOLOGIES","TUCKER, GA","RHEOPAVE XP10","TOR","GTR"]
["16MFO0003",null,"ENTIRE RECYCLING","ROCK PORT, MO",null,"GTR","Binder"]
["16MFO0004",null,"MODIFIED ASPHALT SOLUTIONS","MACON, MO",null,"GTR","Binder"]
["16MFO0005",null,"LIBERTY TIRE RECYCLING","DES MOINES, IA",null,"GTR","Binder"]
["16MFO0006",null,"LEHIGH TECHNOLOGIES","TUCKER, GA",null,"GTR","Binder"]
["16MFO0007",null,"HI-TECH ASPHALT SOLUTIONS","MECHANICSVILLE, VA",null,"Cellulose Fibers","Mixture"]

{"sheet":"Binders","index":3,"n_rows":56,"n_cols":14,"rows_kept":56,"cut":false,"hidden":false,"merged":[]}
[null,null,"Enter Data for Binders"]
[]
[]
[null,null,null,null,null,null,"MIXING","COMPACTION"]
["MATERIAL ID","PLANT ↓","SUPPLIER","LOCATION","GRADE ↓","Gsb","TEMP. °F","TEMP. °F","COST","UNIT ↓"]
["16NWMAT001",null,"FLINT HILLS RESOURCES","OMAHA, NE","PG 64-22",null,null,null,null,"Tons",null,"PG 58-28",null,"Lbs"]
["16NWMAT002",null,"HERZOG","ELWOOD, KS","PG 58-28",null,null,null,null,"Tons",null,"PG 64-22",null,"Tons"]
["16NWMAT003",null,"HERZOG","ELWOOD, KS","PG 64-22",null,null,null,null,"Tons",null,"PG 64-22 Gr. V",null,"Gal"]
[null,null,"HERZOG","ELWOOD, KS","PG 64-22 Gr. H",null,null,null,null,"Tons",null,"PG 64-22 Gr. H"]
[null,null,"HERZOG","ELWOOD, KS","PG 64-22 Gr. V",null,null,null,null,"Tons",null,"PG 70-22"]
["16NEMA0026",null,"MARATHON ASHLAND PETROLEUM","MEREDOSIA, IL","PG 64-22",null,null,null,null,"Tons",null,"PG 76-22"]
["16NEMA0027",null,"MARATHON ASHLAND PETROLEUM","MEREDOSIA, IL","PG 70-22",null,null,null,null,"Tons",null,"PG 76-22 Gr. E"]
["16NEMA0028",null,"FLINT HILLS RESOURCES","DAVENPORT, IA","PG 58-28",null,null,null,null,"Tons",null,"PG 64-28"]
["16KCSRW001",null,"ERGON, INC.","WOLCOTT, KS","PG 58-28",null,null,null,null,"Tons",null,"PG 52-28"]
["16KCSRW002",null,"ERGON, INC.","WOLCOTT, KS","PG 64-22",null,null,null,null,"Tons"]
["16KCSRW003",null,"VANCE BROTHERS","KANSAS CITY, MO","PG 52-28",null,null,null,null,"Tons"]
["16KCSRW004",null,"VANCE BROTHERS","KANSAS CITY, MO","PG 76-22 Gr. E",null,null,null,null,"Tons"]
["16KCDDA059",null,"PHILLIPS 66","KANSAS CITY, MO","PG 52-34",null,null,null,null,"Tons"]
["16KCSRW005",null,"PHILLIPS 66","KANSAS CITY, MO","PG 58-28",null,null,null,null,"Tons"]
["16KCSRW006",null,"PHILLIPS 66","KANSAS CITY, MO","PG 64-22",null,null,null,null,"Tons"]
["16KCSRW007",null,"PHILLIPS 66","KANSAS CITY, MO","PG 64-22 Gr. H",null,null,null,null,"Tons"]
["16KCSRW008",null,"PHILLIPS 66","KANSAS CITY, MO","PG 64-22 Gr. V",null,null,null,null,"Tons"]
["16KCSRW009",null,"PHILLIPS 66","KANSAS CITY, MO","PG 70-22",null,null,null,null,"Tons"]
["16KCSRW010",null,"PHILLIPS 66","KANSAS CITY, MO","PG 76-22",null,null,null,null,"Tons"]
["16KCDDA058",null,"PHILLIPS 66","KANSAS CITY, MO","PG 76-22E",null,null,null,null,"Tons"]
["16SLMRH102",null,"BUCKEYE TERMINALS, LLC","ST. LOUIS, MO","PG 58-22",1.0289999999999999,295,276,null,"Tons"]
["16SLMRH103",null,"BUCKEYE TERMINALS, LLC","ST. LOUIS, MO","PG 58-28",1.0289999999999999,295,276,null,"Tons"]
["16SLMRH104",null,"BUCKEYE TERMINALS, LLC","ST. LOUIS, MO","PG 64-22",1.0329999999999999,308,288,null,"Tons"]
["16SLMRH101",null,"PHILLIPS 66","WOOD RIVER, IL (ROXANNA)","PG 64-22",1.0329999999999999,308,288,null,"Tons"]
["16SLMRH105",null,"PHILLIPS 66","GRANITE CITY, IL","PG 58-28",1.0289999999999999,295,276,null,"Tons"]
["16SLMRH106",null,"PHILLIPS 66","GRANITE CITY, IL","PG 64-22",1.0329999999999999,308,286,null,"Tons"]
["16SLMRH107",null,"PHILLIPS 66","GRANITE CITY, IL","PG 64-22 Gr. H",1.0369999999999999,315,275,null,"Tons"]
["16SLMRH108",null,"PHILLIPS 66","GRANITE CITY, IL","PG 64-22 Gr. V",1.0369999999999999,325,288,null,"Tons"]
["16SLMRH109",null,"PHILLIPS 66","GRANITE CITY, IL","PG 70-22",1.0369999999999999,315,275,null,"Tons"]
["16SLMRH110",null,"PHILLIPS 66","GRANITE CITY, IL","PG 76-22",1.0369999999999999,325,288,null,"Tons"]
["16SLMRH111",null,"APEX Oil Co. Inc.","ST. LOUIS, MO","PG 64-22",1.038,332,310,null,"Tons"]
["16SWASM001",null,"APAC-MO, DAYSTAR TERMINAL","SPRINGFIELD, MO","PG 64-22",null,null,null,null,"Tons"]
["16SWASM002",null,"APAC-MO, DAYSTAR TERMINAL","SPRINGFIELD, MO","PG 70-22",null,null,null,null,"Tons"]
["16SWASM003",null,"APAC-MO, DAYSTAR TERMINAL","SPRINGFIELD, MO","PG 76-22",null,null,null,null,"Tons"]
["16SWASM004",null,"COASTAL ENERGY CORP.","MILLER, MO","PG 58-28",null,null,null,null,"Tons"]
["16SWASM005",null,"COASTAL ENERGY CORP.","MILLER, MO","PG 64-22",null,null,null,null,"Tons"]
["16SEC1D001",null,"COASTAL ENERGY","WILLOW SPRINGS, MO","PG 58-28",1.026,298,278,null,"Tons"]
["16SEC1D002",null,"COASTAL ENERGY","WILLOW SPRINGS, MO","PG 64-22",1.032,311,291,null,"Tons"]
["16SEC1D003",null,"COASTAL ENERGY","WILLOW SPRINGS, MO","PG 64-22 Gr. H",1.0329999999999999,323,303,null,"Tons"]
["16SEC1D004",null,"COASTAL ENERGY","WILLOW SPRINGS, MO","PG 64-22 Gr. V",1.0329999999999999,334,313,null,"Tons"]
["16SEC1D005",null,"COASTAL ENERGY","WILLOW SPRINGS, MO","PG 70-22",1.0329999999999999,334,313,null,"Tons"]
["16SEC1D006",null,"COASTAL ENERGY","WILLOW SPRINGS, MO","PG 76-22",1.0329999999999999,338,318,null,"Tons"]
["16SEMA0002",null,"HEARTLAND ASPHALT MATERIALS","NEW MADRID (MFG W.R., IL)","PG 64-22",null,null,null,null,"Tons"]
["16SEMA0003",null,"HEARTLAND ASPHALT MATERIALS","NEW MADRID (MFG W.R., IL)","PG 70-22",null,null,null,null,"Tons"]
["16SEMA0004",null,"HEARTLAND ASPHALT MATERIALS","NEW MADRID (MFG W.R., IL)","PG 76-22",null,null,null,null,"Tons"]
["16SEMA0005",null,"HEARTLAND ASPHALT MATERIALS","MEMPHIS, TN","PG 64-22",null,null,null,null,"Tons"]
["16SEMA0006",null,"HEARTLAND ASPHALT MATERIALS","MEMPHIS, TN","PG 70-22",null,null,null,null,"Tons"]
["16SEMA0007",null,"HEARTLAND ASPHALT MATERIALS","MEMPHIS, TN","PG 76-22",null,null,null,null,"Tons"]
["16SEMA0008",null,"MARATHON ASHLAND PETROLEUM","MEMPHIS, TN","PG 64-22",null,null,null,null,"Tons"]
["16SEMA0009",null,"MARATHON ASHLAND PETROLEUM","MEMPHIS, TN","PG 70-22",null,null,null,null,"Tons"]
["16SEMA0010",null,"MARATHON ASHLAND PETROLEUM","MEMPHIS, TN","PG 76-22",null,null,null,null,"Tons"]

{"sheet":"Initial_Info1","index":4,"n_rows":49,"n_cols":36,"rows_kept":49,"cut":false,"hidden":false,"merged":[[1,5,1,6],[2,5,2,6],[3,5,3,6],[4,3,4,4],[0,3,0,4]]}
[null,null,null,"INITIAL MIX INFORMATION",null,null,null,null,null,"= user input"]
[null,"PROJECT ID",null,null,"PLANT LOCATION ↓",null,null,null,null,null,"Type","Gyr./Blows"]
[null,"CONTRACTOR",null,null,"PLANT TYPE",null,null,null,null,null,"STL - C",40]
[null,"CONTRACT (Project #)",null,null,"LAB MIXER",null,null,null,null,null,"STL - D",40]
[null,"COUNTY",null,"LA LOSS COARSE AGG. FOR NON-CARBONATE",null,null,null,null,null,null,"STL - X",40,"NON-MODOT MIXTURES",null,null,null,null,null,null,null,null,null,null,null,null,null,null,null,null,"BB","B",9,125,205,"Gyratory",150]
[null,"ROUTES",null,null,{"$f":"IF($D$7=\"\",\"\",VLOOKUP($D$7,$AE$5:$AH$33,2,FALSE))","v":""},null,null,null,null,null,null,null,"ENTER GRADATION LIMITS ON BLENDING SHEET",null,null,null,null,null,null,null,null,null,null,null,null,null,null,null,null,"BP-1","BLP",9,125,205,"Marshall",100]
[null,"MIX TYPE ↓",null,null,{"$f":"IF($D$7=\"\",IF(IFERROR(MATCH(TRUE,(C7=K3:K12),0),FALSE),INDEX(K3:L12,MATCH(C7,K3:K12,0),2),IF(LEFT(C7,2)=\"UB\",100,35)),VLOOKUP($D$7,$AE$5:$AH$33,3,FALSE))","v":{"$error":"#N/A"}},"Gyratory","MOLD DIAMETER",150,"mm",null,null,null,null,null,null,null,null,null,null,null,null,null,null,null,null,null,null,null,null,"BP-2","BSM",9,100,""]
[null,"DESIGN SPECIMEN WT.",null,null,{"$f":"IF($D$7=\"\",\"\",VLOOKUP($D$7,$AE$5:$AH$33,4,FALSE))","v":""},null,null,null,null,null,null,null,null,null,null,null,null,null,null,null,null,null,null,null,null,null,null,null,null,"BP-3","BSMR",9,100,""]
[null,"DATE","2016-01-07",null,null,null,null,null,null,null,null,null,null,null,null,null,null,null,null,null,null,null,null,null,null,null,null,null,null,"SL","C",8,100,160]
[null,"Binder",null,null,null,null,null,null,null,null,null,null,null,null,null,null,null,null,null,null,null,null,null,null,null,null,null,null,null,"SP048","CLP",8,100,160]
[null,"Material ID ↓","Source","Location","Grade","In-Line Grade ↓","Contract Grade ↓","Gb",null,null,null,null,null,null,null,null,null,null,null,null,null,null,null,null,null,null,null,null,null,"SP095","CLG","",80,""]
[null,null,{"$f":"IFERROR(IF(OR(ISNA(MATCH(TRUE,(BindPlant=$F$2),0)),ISNA(MATCH(1,(BindMID=$B12)*(BindPlant=$F$2),0))),INDEX(Binder,MATCH(TRUE,(BindMID=$B12),0),3),INDEX(Binder,MATCH(1,(BindMID=$B12)*(BindPlant=$F$2),0),3)),\"\")","v":"HERZOG"},{"$f":"IFERROR(IF(OR(ISNA(MATCH(TRUE,(BindPlant=$F$2),0)),ISNA(MATCH(1,(BindMID=$B12)*(BindPlant=$F$2),0))),INDEX(Binder,MATCH(TRUE,(BindMID=$B12),0),4),INDEX(Binder,MATCH(1,(BindMID=$B12)*(BindPlant=$F$2),0),4)),\"\")","v":"ELWOOD, KS"},{"$f":"IFERROR(IF(OR(ISNA(MATCH(TRUE,(BindPlant=$F$2),0)),ISNA(MATCH(1,(BindMID=$B12)*(BindPlant=$F$2),0))),INDEX(Binder,MATCH(TRUE,(BindMID=$B12),0),5),INDEX(Binder,MATCH(1,(BindMID=$B12)*(BindPlant=$F$2),0),5)),\"\")","v":"PG 64-22 Gr. H"},null,null,{"$f":"IFERROR(IF(OR(ISNA(MATCH(TRUE,(BindPlant=$F$2),0)),ISNA(MATCH(1,(BindMID=$B12)*(BindPlant=$F$2),0))),INDEX(Binder,MATCH(TRUE,(BindMID=$B12),0),6),INDEX(Binder,MATCH(1,(BindMID=$B12)*(BindPlant=$F$2),0),6)),\"\")","v":0},null,null,null,null,null,null,null,null,null,null,null,null,null,null,null,null,null,null,null,null,null,"SP125","CLGLP","",80,""]
[null,null,null,"Mixing Temperature (°F)",{"$f":"IFERROR(IF(OR(ISNA(MATCH(TRUE,(BindPlant=$F$2),0)),ISNA(MATCH(1,(BindMID=$B12)*(BindPlant=$F$2),0))),INDEX(Binder,MATCH(TRUE,(BindMID=$B12),0),7),INDEX(Binder,MATCH(1,(BindMID=$B12)*(BindPlant=$F$2),0),7)),\"\")","v":0},null,null,null,null,null,null,null,null,null,null,null,null,null,null,null,null,null,null,null,null,null,null,null,null,"SP190","CNC",8,100,160]
[null,null,null,"Compaction Temperature (°F)",{"$f":"IFERROR(IF(OR(ISNA(MATCH(TRUE,(BindPlant=$F$2),0)),ISNA(MATCH(1,(BindMID=$B12)*(BindPlant=$F$2),0))),INDEX(Binder,MATCH(TRUE,(BindMID=$B12),0),8),INDEX(Binder,MATCH(1,(BindMID=$B12)*(BindPlant=$F$2),0),8)),\"\")","v":0},null,null,null,null,null,null,null,null,null,null,null,null,null,null,null,null,null,null,null,null,null,null,null,null,"SP250","CLGNC","",80,""]
[null,"BINDER ADDITIVES (Anti-strip, Warm Mix, Rejuvenator, GTR and Vestenamer)",null,null,null,null,null,null,null,null,null,null,null,null,null,null,null,null,null,null,null,null,null,null,null,null,null,null,null,"UBAWS - A","E",7,75,115]
[null,"Material ID ↓","Source","Location","Brand Name","Type","Addition Rate by","Rate",null,null,null,null,null,null,null,null,null,null,null,null,null,null,null,null,null,null,null,null,null,"UBAWS - B","F","",50,""]
[null,null,{"$f":"IFERROR(IF(OR(ISNA(MATCH(TRUE,(AdPlant=$F$2),0)),ISNA(MATCH(1,(AdMID=$B17)*(AdPlant=$F$2),0))),INDEX(Addtv,MATCH(TRUE,(AdMID=$B17),0),3),INDEX(Addtv,MATCH(1,(AdMID=$B17)*(AdPlant=$F$2),0),3)),\"\")","v":"INNOPHOS, INC."},{"$f":"IFERROR(IF(OR(ISNA(MATCH(TRUE,(AdPlant=$F$2),0)),ISNA(MATCH(1,(AdMID=$B17)*(AdPlant=$F$2),0))),INDEX(Addtv,MATCH(TRUE,(AdMID=$B17),0),4),INDEX(Addtv,MATCH(1,(AdMID=$B17)*(AdPlant=$F$2),0),4)),\"\")","v":"CRANBURY, NJ"},{"$f":"IFERROR(IF(OR(ISNA(MATCH(TRUE,(AdPlant=$F$2),0)),ISNA(MATCH(1,(AdMID=$B17)*(AdPlant=$F$2),0))),INDEX(Addtv,MATCH(TRUE,(AdMID=$B17),0),5),INDEX(Addtv,MATCH(1,(AdMID=$B17)*(AdPlant=$F$2),0),5)),\"\")","v":"INNOVALT W"},{"$f":"IFERROR(IF(OR(ISNA(MATCH(TRUE,(AdPlant=$F$2),0)),ISNA(MATCH(1,(AdMID=$B17)*(AdPlant=$F$2),0))),INDEX(Addtv,MATCH(TRUE,(AdMID=$B17),0),6),INDEX(Addtv,MATCH(1,(AdMID=$B17)*(AdPlant=$F$2),0),6)),\"\")","v":"Anti-Strip"},{"$f":"IFERROR(IF(OR(ISNA(MATCH(TRUE,(AdPlant=$F$2),0)),ISNA(MATCH(1,(AdMID=$B17)*(AdPlant=$F$2),0))),INDEX(Addtv,MATCH(TRUE,(AdMID=$B17),0),7),INDEX(Addtv,MATCH(1,(AdMID=$B17)*(AdPlant=$F$2),0),7)),\"\")","v":"Binder"},null,null,null,null,null,null,null,null,null,null,null,null,null,null,null,null,null,null,null,null,null,null,"UBAWS - C","FNC","",50,""]
[null,null,{"$f":"IFERROR(IF(OR(ISNA(MATCH(TRUE,(AdPlant=$F$2),0)),ISNA(MATCH(1,(AdMID=$B18)*(AdPlant=$F$2),0))),INDEX(Addtv,MATCH(TRUE,(AdMID=$B18),0),3),INDEX(Addtv,MATCH(1,(AdMID=$B18)*(AdPlant=$F$2),0),3)),\"\")","v":"INNOPHOS, INC."},{"$f":"IFERROR(IF(OR(ISNA(MATCH(TRUE,(AdPlant=$F$2),0)),ISNA(MATCH(1,(AdMID=$B18)*(AdPlant=$F$2),0))),INDEX(Addtv,MATCH(TRUE,(AdMID=$B18),0),4),INDEX(Addtv,MATCH(1,(AdMID=$B18)*(AdPlant=$F$2),0),4)),\"\")","v":"CRANBURY, NJ"},{"$f":"IFERROR(IF(OR(ISNA(MATCH(TRUE,(AdPlant=$F$2),0)),ISNA(MATCH(1,(AdMID=$B18)*(AdPlant=$F$2),0))),INDEX(Addtv,MATCH(TRUE,(AdMID=$B18),0),5),INDEX(Addtv,MATCH(1,(AdMID=$B18)*(AdPlant=$F$2),0),5)),\"\")","v":"INNOVALT W"},{"$f":"IFERROR(IF(OR(ISNA(MATCH(TRUE,(AdPlant=$F$2),0)),ISNA(MATCH(1,(AdMID=$B18)*(AdPlant=$F$2),0))),INDEX(Addtv,MATCH(TRUE,(AdMID=$B18),0),6),INDEX(Addtv,MATCH(1,(AdMID=$B18)*(AdPlant=$F$2),0),6)),\"\")","v":"Anti-Strip"},{"$f":"IFERROR(IF(OR(ISNA(MATCH(TRUE,(AdPlant=$F$2),0)),ISNA(MATCH(1,(AdMID=$B18)*(AdPlant=$F$2),0))),INDEX(Addtv,MATCH(TRUE,(AdMID=$B18),0),7),INDEX(Addtv,MATCH(1,(AdMID=$B18)*(AdPlant=$F$2),0),7)),\"\")","v":"Binder"},null,null,null,null,null,null,null,null,null,null,null,null,null,null,null,null,null,null,null,null,null,null,{"$f":"IF(K3=\"\",\"\",K3)","v":"STL - C"}]
[null,null,{"$f":"IFERROR(IF(OR(ISNA(MATCH(TRUE,(AdPlant=$F$2),0)),ISNA(MATCH(1,(AdMID=$B19)*(AdPlant=$F$2),0))),INDEX(Addtv,MATCH(TRUE,(AdMID=$B19),0),3),INDEX(Addtv,MATCH(1,(AdMID=$B19)*(AdPlant=$F$2),0),3)),\"\")","v":"INNOPHOS, INC."},{"$f":"IFERROR(IF(OR(ISNA(MATCH(TRUE,(AdPlant=$F$2),0)),ISNA(MATCH(1,(AdMID=$B19)*(AdPlant=$F$2),0))),INDEX(Addtv,MATCH(TRUE,(AdMID=$B19),0),4),INDEX(Addtv,MATCH(1,(AdMID=$B19)*(AdPlant=$F$2),0),4)),\"\")","v":"CRANBURY, NJ"},{"$f":"IFERROR(IF(OR(ISNA(MATCH(TRUE,(AdPlant=$F$2),0)),ISNA(MATCH(1,(AdMID=$B19)*(AdPlant=$F$2),0))),INDEX(Addtv,MATCH(TRUE,(AdMID=$B19),0),5),INDEX(Addtv,MATCH(1,(AdMID=$B19)*(AdPlant=$F$2),0),5)),\"\")","v":"INNOVALT W"},{"$f":"IFERROR(IF(OR(ISNA(MATCH(TRUE,(AdPlant=$F$2),0)),ISNA(MATCH(1,(AdMID=$B19)*(AdPlant=$F$2),0))),INDEX(Addtv,MATCH(TRUE,(AdMID=$B19),0),6),INDEX(Addtv,MATCH(1,(AdMID=$B19)*(AdPlant=$F$2),0),6)),\"\")","v":"Anti-Strip"},{"$f":"IFERROR(IF(OR(ISNA(MATCH(TRUE,(AdPlant=$F$2),0)),ISNA(MATCH(1,(AdMID=$B19)*(AdPlant=$F$2),0))),INDEX(Addtv,MATCH(TRUE,(AdMID=$B19),0),7),INDEX(Addtv,MATCH(1,(AdMID=$B19)*(AdPlant=$F$2),0),7)),\"\")","v":"Binder"},null,null,null,null,null,null,null,null,null,null,null,null,null,null,null,null,null,null,null,null,null,null,{"$f":"IF(K4=\"\",\"\",K4)","v":"STL - D"}]
[null,null,{"$f":"IFERROR(IF(OR(ISNA(MATCH(TRUE,(AdPlant=$F$2),0)),ISNA(MATCH(1,(AdMID=$B20)*(AdPlant=$F$2),0))),INDEX(Addtv,MATCH(TRUE,(AdMID=$B20),0),3),INDEX(Addtv,MATCH(1,(AdMID=$B20)*(AdPlant=$F$2),0),3)),\"\")","v":"INNOPHOS, INC."},{"$f":"IFERROR(IF(OR(ISNA(MATCH(TRUE,(AdPlant=$F$2),0)),ISNA(MATCH(1,(AdMID=$B20)*(AdPlant=$F$2),0))),INDEX(Addtv,MATCH(TRUE,(AdMID=$B20),0),4),INDEX(Addtv,MATCH(1,(AdMID=$B20)*(AdPlant=$F$2),0),4)),\"\")","v":"CRANBURY, NJ"},{"$f":"IFERROR(IF(OR(ISNA(MATCH(TRUE,(AdPlant=$F$2),0)),ISNA(MATCH(1,(AdMID=$B20)*(AdPlant=$F$2),0))),INDEX(Addtv,MATCH(TRUE,(AdMID=$B20),0),5),INDEX(Addtv,MATCH(1,(AdMID=$B20)*(AdPlant=$F$2),0),5)),\"\")","v":"INNOVALT W"},{"$f":"IFERROR(IF(OR(ISNA(MATCH(TRUE,(AdPlant=$F$2),0)),ISNA(MATCH(1,(AdMID=$B20)*(AdPlant=$F$2),0))),INDEX(Addtv,MATCH(TRUE,(AdMID=$B20),0),6),INDEX(Addtv,MATCH(1,(AdMID=$B20)*(AdPlant=$F$2),0),6)),\"\")","v":"Anti-Strip"},{"$f":"IFERROR(IF(OR(ISNA(MATCH(TRUE,(AdPlant=$F$2),0)),ISNA(MATCH(1,(AdMID=$B20)*(AdPlant=$F$2),0))),INDEX(Addtv,MATCH(TRUE,(AdMID=$B20),0),7),INDEX(Addtv,MATCH(1,(AdMID=$B20)*(AdPlant=$F$2),0),7)),\"\")","v":"Binder"},null,null,null,null,null,null,null,null,null,null,null,null,null,null,null,null,null,null,null,null,null,null,"STL - X"]
[null,null,{"$f":"IFERROR(IF(OR(ISNA(MATCH(TRUE,(AdPlant=$F$2),0)),ISNA(MATCH(1,(AdMID=$B21)*(AdPlant=$F$2),0))),INDEX(Addtv,MATCH(TRUE,(AdMID=$B21),0),3),INDEX(Addtv,MATCH(1,(AdMID=$B21)*(AdPlant=$F$2),0),3)),\"\")","v":"INNOPHOS, INC."},{"$f":"IFERROR(IF(OR(ISNA(MATCH(TRUE,(AdPlant=$F$2),0)),ISNA(MATCH(1,(AdMID=$B21)*(AdPlant=$F$2),0))),INDEX(Addtv,MATCH(TRUE,(AdMID=$B21),0),4),INDEX(Addtv,MATCH(1,(AdMID=$B21)*(AdPlant=$F$2),0),4)),\"\")","v":"CRANBURY, NJ"},{"$f":"IFERROR(IF(OR(ISNA(MATCH(TRUE,(AdPlant=$F$2),0)),ISNA(MATCH(1,(AdMID=$B21)*(AdPlant=$F$2),0))),INDEX(Addtv,MATCH(TRUE,(AdMID=$B21),0),5),INDEX(Addtv,MATCH(1,(AdMID=$B21)*(AdPlant=$F$2),0),5)),\"\")","v":"INNOVALT W"},{"$f":"IFERROR(IF(OR(ISNA(MATCH(TRUE,(AdPlant=$F$2),0)),ISNA(MATCH(1,(AdMID=$B21)*(AdPlant=$F$2),0))),INDEX(Addtv,MATCH(TRUE,(AdMID=$B21),0),6),INDEX(Addtv,MATCH(1,(AdMID=$B21)*(AdPlant=$F$2),0),6)),\"\")","v":"Anti-Strip"},{"$f":"IFERROR(IF(OR(ISNA(MATCH(TRUE,(AdPlant=$F$2),0)),ISNA(MATCH(1,(AdMID=$B21)*(AdPlant=$F$2),0))),INDEX(Addtv,MATCH(TRUE,(AdMID=$B21),0),7),INDEX(Addtv,MATCH(1,(AdMID=$B21)*(AdPlant=$F$2),0),7)),\"\")","v":"Binder"},null,null,null,null,null,null,null,null,null,null,null,null,null,null,null,null,null,null,null,null,null,null,""]
[null,"AGGREGATE ADDITIVES (Fibers)",null,null,null,null,null,null,null,null,null,null,null,null,null,null,null,null,null,null,null,null,null,null,null,null,null,null,null,""]
[null,"Material ID ↓","Source","Location","Brand Name","Type","Addition Rate by","Rate",null,null,null,null,null,null,null,null,null,null,null,null,null,null,null,null,null,null,null,null,null,""]
[null,null,{"$f":"IFERROR(IF(OR(ISNA(MATCH(TRUE,(AdPlant=$F$2),0)),ISNA(MATCH(1,(AdMID=$B24)*(AdPlant=$F$2),0))),INDEX(Addtv,MATCH(TRUE,(AdMID=$B24),0),3),INDEX(Addtv,MATCH(1,(AdMID=$B24)*(AdPlant=$F$2),0),3)),\"\")","v":"INNOPHOS, INC."},{"$f":"IFERROR(IF(OR(ISNA(MATCH(TRUE,(AdPlant=$F$2),0)),ISNA(MATCH(1,(AdMID=$B24)*(AdPlant=$F$2),0))),INDEX(Addtv,MATCH(TRUE,(AdMID=$B24),0),4),INDEX(Addtv,MATCH(1,(AdMID=$B24)*(AdPlant=$F$2),0),4)),\"\")","v":"CRANBURY, NJ"},{"$f":"IFERROR(IF(OR(ISNA(MATCH(TRUE,(AdPlant=$F$2),0)),ISNA(MATCH(1,(AdMID=$B24)*(AdPlant=$F$2),0))),INDEX(Addtv,MATCH(TRUE,(AdMID=$B24),0),5),INDEX(Addtv,MATCH(1,(AdMID=$B24)*(AdPlant=$F$2),0),5)),\"\")","v":"INNOVALT W"},{"$f":"IFERROR(IF(OR(ISNA(MATCH(TRUE,(AdPlant=$F$2),0)),ISNA(MATCH(1,(AdMID=$B24)*(AdPlant=$F$2),0))),INDEX(Addtv,MATCH(TRUE,(AdMID=$B24),0),6),INDEX(Addtv,MATCH(1,(AdMID=$B24)*(AdPlant=$F$2),0),6)),\"\")","v":"Anti-Strip"},{"$f":"IFERROR(IF(OR(ISNA(MATCH(TRUE,(AdPlant=$F$2),0)),ISNA(MATCH(1,(AdMID=$B24)*(AdPlant=$F$2),0))),INDEX(Addtv,MATCH(TRUE,(AdMID=$B24),0),7),INDEX(Addtv,MATCH(1,(AdMID=$B24)*(AdPlant=$F$2),0),7)),\"\")","v":"Binder"},null,null,null,null,null,null,null,null,null,null,null,null,null,null,null,null,null,null,null,null,null,null,""]
[null,null,null,null,null,null,null,null,null,null,null,"Percent Passing by Weight",null,null,null,null,null,null,null,null,null,null,null,null,null,null,null,null,null,""]
[null,"COARSE AGGREGATE",null,null,null,null,null,null,null,null,null,"2\"","1 1/2\"","1\"","3/4\"","1/2\"","3/8\"","#4","#8","#16","#30","#50","#100","#200",null,null,null,null,null,""]
[null,"Material ID ↓","Source","Location","Formation","Ledge(s)","Source ID","Size","Grading","% Chert","Non-Polish",50,37.5,25,19,12.5,9.5,4.75,2.36,1.18,0.6,0.3,0.15,7.4999999999999997E-2,null,null,null,null,null,""]
[null,null,{"$f":"IFERROR(IF(OR(ISNA(MATCH(TRUE,(AgPlant=$F$2),0)),ISNA(MATCH(1,(AgMID=$B28)*(AgPlant=$F$2),0))),INDEX(Aggs,MATCH(TRUE,(AgMID=$B28),0),3),INDEX(Aggs,MATCH(1,(AgMID=$B28)*(AgPlant=$F$2),0),3)),\"\")","v":0},{"$f":"IFERROR(IF(OR(ISNA(MATCH(TRUE,(AgPlant=$F$2),0)),ISNA(MATCH(1,(AgMID=$B28)*(AgPlant=$F$2),0))),INDEX(Aggs,MATCH(TRUE,(AgMID=$B28),0),4),INDEX(Aggs,MATCH(1,(AgMID=$B28)*(AgPlant=$F$2),0),4)),\"\")","v":0},{"$f":"IFERROR(IF(OR(ISNA(MATCH(TRUE,(AgPlant=$F$2),0)),ISNA(MATCH(1,(AgMID=$B28)*(AgPlant=$F$2),0))),INDEX(Aggs,MATCH(TRUE,(AgMID=$B28),0),5),INDEX(Aggs,MATCH(1,(AgMID=$B28)*(AgPlant=$F$2),0),5)),\"\")","v":0},{"$f":"IFERROR(IF(OR(ISNA(MATCH(TRUE,(AgPlant=$F$2),0)),ISNA(MATCH(1,(AgMID=$B28)*(AgPlant=$F$2),0))),INDEX(Aggs,MATCH(TRUE,(AgMID=$B28),0),6),INDEX(Aggs,MATCH(1,(AgMID=$B28)*(AgPlant=$F$2),0),6)),\"\")","v":0},{"$f":"IFERROR(IF(OR(ISNA(MATCH(TRUE,(AgPlant=$F$2),0)),ISNA(MATCH(1,(AgMID=$B28)*(AgPlant=$F$2),0))),INDEX(Aggs,MATCH(TRUE,(AgMID=$B28),0),7),INDEX(Aggs,MATCH(1,(AgMID=$B28)*(AgPlant=$F$2),0),7)),\"\")","v":0},{"$f":"IFERROR(IF(OR(ISNA(MATCH(TRUE,(AgPlant=$F$2),0)),ISNA(MATCH(1,(AgMID=$B28)*(AgPlant=$F$2),0))),INDEX(Aggs,MATCH(TRUE,(AgMID=$B28),0),8),INDEX(Aggs,MATCH(1,(AgMID=$B28)*(AgPlant=$F$2),0),8)),\"\")","v":0},{"$f":"IFERROR(IF(OR(ISNA(MATCH(TRUE,(AgPlant=$F$2),0)),ISNA(MATCH(1,(AgMID=$B28)*(AgPlant=$F$2),0))),INDEX(Aggs,MATCH(TRUE,(AgMID=$B28),0),9),INDEX(Aggs,MATCH(1,(AgMID=$B28)*(AgPlant=$F$2),0),9)),\"\")","v":0},{"$f":"IFERROR(IF(OR(ISNA(MATCH(TRUE,(AgPlant=$F$2),0)),ISNA(MATCH(1,(AgMID=$B28)*(AgPlant=$F$2),0))),INDEX(Aggs,MATCH(TRUE,(AgMID=$B28),0),10),INDEX(Aggs,MATCH(1,(AgMID=$B28)*(AgPlant=$F$2),0),10)),\"\")","v":0},{"$f":"IFERROR(IF(OR(ISNA(MATCH(TRUE,(AgPlant=$F$2),0)),ISNA(MATCH(1,(AgMID=$B28)*(AgPlant=$F$2),0))),INDEX(Aggs,MATCH(TRUE,(AgMID=$B28),0),11),INDEX(Aggs,MATCH(1,(AgMID=$B28)*(AgPlant=$F$2),0),11)),\"\")","v":0},{"$f":"IFERROR(IF(OR(ISNA(MATCH(TRUE,(AgPlant=$F$2),0)),ISNA(MATCH(1,(AgMID=$B28)*(AgPlant=$F$2),0))),INDEX(Aggs,MATCH(TRUE,(AgMID=$B28),0),12),INDEX(Aggs,MATCH(1,(AgMID=$B28)*(AgPlant=$F$2),0),12)),\"\")","v":0},{"$f":"IFERROR(IF(OR(ISNA(MATCH(TRUE,(AgPlant=$F$2),0)),ISNA(MATCH(1,(AgMID=$B28)*(AgPlant=$F$2),0))),INDEX(Aggs,MATCH(TRUE,(AgMID=$B28),0),13),INDEX(Aggs,MATCH(1,(AgMID=$B28)*(AgPlant=$F$2),0),13)),\"\")","v":0},{"$f":"IFERROR(IF(OR(ISNA(MATCH(TRUE,(AgPlant=$F$2),0)),ISNA(MATCH(1,(AgMID=$B28)*(AgPlant=$F$2),0))),INDEX(Aggs,MATCH(TRUE,(AgMID=$B28),0),14),INDEX(Aggs,MATCH(1,(AgMID=$B28)*(AgPlant=$F$2),0),14)),\"\")","v":0},{"$f":"IFERROR(IF(OR(ISNA(MATCH(TRUE,(AgPlant=$F$2),0)),ISNA(MATCH(1,(AgMID=$B28)*(AgPlant=$F$2),0))),INDEX(Aggs,MATCH(TRUE,(AgMID=$B28),0),15),INDEX(Aggs,MATCH(1,(AgMID=$B28)*(AgPlant=$F$2),0),15)),\"\")","v":0},{"$f":"IFERROR(IF(OR(ISNA(MATCH(TRUE,(AgPlant=$F$2),0)),ISNA(MATCH(1,(AgMID=$B28)*(AgPlant=$F$2),0))),INDEX(Aggs,MATCH(TRUE,(AgMID=$B28),0),16),INDEX(Aggs,MATCH(1,(AgMID=$B28)*(AgPlant=$F$2),0),16)),\"\")","v":0},{"$f":"IFERROR(IF(OR(ISNA(MATCH(TRUE,(AgPlant=$F$2),0)),ISNA(MATCH(1,(AgMID=$B28)*(AgPlant=$F$2),0))),INDEX(Aggs,MATCH(TRUE,(AgMID=$B28),0),17),INDEX(Aggs,MATCH(1,(AgMID=$B28)*(AgPlant=$F$2),0),17)),\"\")","v":0},{"$f":"IFERROR(IF(OR(ISNA(MATCH(TRUE,(AgPlant=$F$2),0)),ISNA(MATCH(1,(AgMID=$B28)*(AgPlant=$F$2),0))),INDEX(Aggs,MATCH(TRUE,(AgMID=$B28),0),18),INDEX(Aggs,MATCH(1,(AgMID=$B28)*(AgPlant=$F$2),0),18)),\"\")","v":0},{"$f":"IFERROR(IF(OR(ISNA(MATCH(TRUE,(AgPlant=$F$2),0)),ISNA(MATCH(1,(AgMID=$B28)*(AgPlant=$F$2),0))),INDEX(Aggs,MATCH(TRUE,(AgMID=$B28),0),19),INDEX(Aggs,MATCH(1,(AgMID=$B28)*(AgPlant=$F$2),0),19)),\"\")","v":0},{"$f":"IFERROR(IF(OR(ISNA(MATCH(TRUE,(AgPlant=$F$2),0)),ISNA(MATCH(1,(AgMID=$B28)*(AgPlant=$F$2),0))),INDEX(Aggs,MATCH(TRUE,(AgMID=$B28),0),20),INDEX(Aggs,MATCH(1,(AgMID=$B28)*(AgPlant=$F$2),0),20)),\"\")","v":0},{"$f":"IFERROR(IF(OR(ISNA(MATCH(TRUE,(AgPlant=$F$2),0)),ISNA(MATCH(1,(AgMID=$B28)*(AgPlant=$F$2),0))),INDEX(Aggs,MATCH(TRUE,(AgMID=$B28),0),21),INDEX(Aggs,MATCH(1,(AgMID=$B28)*(AgPlant=$F$2),0),21)),\"\")","v":0},{"$f":"IFERROR(IF(OR(ISNA(MATCH(TRUE,(AgPlant=$F$2),0)),ISNA(MATCH(1,(AgMID=$B28)*(AgPlant=$F$2),0))),INDEX(Aggs,MATCH(TRUE,(AgMID=$B28),0),22),INDEX(Aggs,MATCH(1,(AgMID=$B28)*(AgPlant=$F$2),0),22)),\"\")","v":0},{"$f":"IFERROR(IF(OR(ISNA(MATCH(TRUE,(AgPlant=$F$2),0)),ISNA(MATCH(1,(AgMID=$B28)*(AgPlant=$F$2),0))),INDEX(Aggs,MATCH(TRUE,(AgMID=$B28),0),23),INDEX(Aggs,MATCH(1,(AgMID=$B28)*(AgPlant=$F$2),0),23)),\"\")","v":0},{"$f":"IFERROR(IF(OR(ISNA(MATCH(TRUE,(AgPlant=$F$2),0)),ISNA(MATCH(1,(AgMID=$B28)*(AgPlant=$F$2),0))),INDEX(Aggs,MATCH(TRUE,(AgMID=$B28),0),24),INDEX(Aggs,MATCH(1,(AgMID=$B28)*(AgPlant=$F$2),0),24)),\"\")","v":0}]
[null,null,{"$f":"IFERROR(IF(OR(ISNA(MATCH(TRUE,(AgPlant=$F$2),0)),ISNA(MATCH(1,(AgMID=$B29)*(AgPlant=$F$2),0))),INDEX(Aggs,MATCH(TRUE,(AgMID=$B29),0),3),INDEX(Aggs,MATCH(1,(AgMID=$B29)*(AgPlant=$F$2),0),3)),\"\")","v":0},{"$f":"IFERROR(IF(OR(ISNA(MATCH(TRUE,(AgPlant=$F$2),0)),ISNA(MATCH(1,(AgMID=$B29)*(AgPlant=$F$2),0))),INDEX(Aggs,MATCH(TRUE,(AgMID=$B29),0),4),INDEX(Aggs,MATCH(1,(AgMID=$B29)*(AgPlant=$F$2),0),4)),\"\")","v":0},{"$f":"IFERROR(IF(OR(ISNA(MATCH(TRUE,(AgPlant=$F$2),0)),ISNA(MATCH(1,(AgMID=$B29)*(AgPlant=$F$2),0))),INDEX(Aggs,MATCH(TRUE,(AgMID=$B29),0),5),INDEX(Aggs,MATCH(1,(AgMID=$B29)*(AgPlant=$F$2),0),5)),\"\")","v":0},{"$f":"IFERROR(IF(OR(ISNA(MATCH(TRUE,(AgPlant=$F$2),0)),ISNA(MATCH(1,(AgMID=$B29)*(AgPlant=$F$2),0))),INDEX(Aggs,MATCH(TRUE,(AgMID=$B29),0),6),INDEX(Aggs,MATCH(1,(AgMID=$B29)*(AgPlant=$F$2),0),6)),\"\")","v":0},{"$f":"IFERROR(IF(OR(ISNA(MATCH(TRUE,(AgPlant=$F$2),0)),ISNA(MATCH(1,(AgMID=$B29)*(AgPlant=$F$2),0))),INDEX(Aggs,MATCH(TRUE,(AgMID=$B29),0),7),INDEX(Aggs,MATCH(1,(AgMID=$B29)*(AgPlant=$F$2),0),7)),\"\")","v":0},{"$f":"IFERROR(IF(OR(ISNA(MATCH(TRUE,(AgPlant=$F$2),0)),ISNA(MATCH(1,(AgMID=$B29)*(AgPlant=$F$2),0))),INDEX(Aggs,MATCH(TRUE,(AgMID=$B29),0),8),INDEX(Aggs,MATCH(1,(AgMID=$B29)*(AgPlant=$F$2),0),8)),\"\")","v":0},{"$f":"IFERROR(IF(OR(ISNA(MATCH(TRUE,(AgPlant=$F$2),0)),ISNA(MATCH(1,(AgMID=$B29)*(AgPlant=$F$2),0))),INDEX(Aggs,MATCH(TRUE,(AgMID=$B29),0),9),INDEX(Aggs,MATCH(1,(AgMID=$B29)*(AgPlant=$F$2),0),9)),\"\")","v":0},{"$f":"IFERROR(IF(OR(ISNA(MATCH(TRUE,(AgPlant=$F$2),0)),ISNA(MATCH(1,(AgMID=$B29)*(AgPlant=$F$2),0))),INDEX(Aggs,MATCH(TRUE,(AgMID=$B29),0),10),INDEX(Aggs,MATCH(1,(AgMID=$B29)*(AgPlant=$F$2),0),10)),\"\")","v":0},{"$f":"IFERROR(IF(OR(ISNA(MATCH(TRUE,(AgPlant=$F$2),0)),ISNA(MATCH(1,(AgMID=$B29)*(AgPlant=$F$2),0))),INDEX(Aggs,MATCH(TRUE,(AgMID=$B29),0),11),INDEX(Aggs,MATCH(1,(AgMID=$B29)*(AgPlant=$F$2),0),11)),\"\")","v":0},{"$f":"IFERROR(IF(OR(ISNA(MATCH(TRUE,(AgPlant=$F$2),0)),ISNA(MATCH(1,(AgMID=$B29)*(AgPlant=$F$2),0))),INDEX(Aggs,MATCH(TRUE,(AgMID=$B29),0),12),INDEX(Aggs,MATCH(1,(AgMID=$B29)*(AgPlant=$F$2),0),12)),\"\")","v":0},{"$f":"IFERROR(IF(OR(ISNA(MATCH(TRUE,(AgPlant=$F$2),0)),ISNA(MATCH(1,(AgMID=$B29)*(AgPlant=$F$2),0))),INDEX(Aggs,MATCH(TRUE,(AgMID=$B29),0),13),INDEX(Aggs,MATCH(1,(AgMID=$B29)*(AgPlant=$F$2),0),13)),\"\")","v":0},{"$f":"IFERROR(IF(OR(ISNA(MATCH(TRUE,(AgPlant=$F$2),0)),ISNA(MATCH(1,(AgMID=$B29)*(AgPlant=$F$2),0))),INDEX(Aggs,MATCH(TRUE,(AgMID=$B29),0),14),INDEX(Aggs,MATCH(1,(AgMID=$B29)*(AgPlant=$F$2),0),14)),\"\")","v":0},{"$f":"IFERROR(IF(OR(ISNA(MATCH(TRUE,(AgPlant=$F$2),0)),ISNA(MATCH(1,(AgMID=$B29)*(AgPlant=$F$2),0))),INDEX(Aggs,MATCH(TRUE,(AgMID=$B29),0),15),INDEX(Aggs,MATCH(1,(AgMID=$B29)*(AgPlant=$F$2),0),15)),\"\")","v":0},{"$f":"IFERROR(IF(OR(ISNA(MATCH(TRUE,(AgPlant=$F$2),0)),ISNA(MATCH(1,(AgMID=$B29)*(AgPlant=$F$2),0))),INDEX(Aggs,MATCH(TRUE,(AgMID=$B29),0),16),INDEX(Aggs,MATCH(1,(AgMID=$B29)*(AgPlant=$F$2),0),16)),\"\")","v":0},{"$f":"IFERROR(IF(OR(ISNA(MATCH(TRUE,(AgPlant=$F$2),0)),ISNA(MATCH(1,(AgMID=$B29)*(AgPlant=$F$2),0))),INDEX(Aggs,MATCH(TRUE,(AgMID=$B29),0),17),INDEX(Aggs,MATCH(1,(AgMID=$B29)*(AgPlant=$F$2),0),17)),\"\")","v":0},{"$f":"IFERROR(IF(OR(ISNA(MATCH(TRUE,(AgPlant=$F$2),0)),ISNA(MATCH(1,(AgMID=$B29)*(AgPlant=$F$2),0))),INDEX(Aggs,MATCH(TRUE,(AgMID=$B29),0),18),INDEX(Aggs,MATCH(1,(AgMID=$B29)*(AgPlant=$F$2),0),18)),\"\")","v":0},{"$f":"IFERROR(IF(OR(ISNA(MATCH(TRUE,(AgPlant=$F$2),0)),ISNA(MATCH(1,(AgMID=$B29)*(AgPlant=$F$2),0))),INDEX(Aggs,MATCH(TRUE,(AgMID=$B29),0),19),INDEX(Aggs,MATCH(1,(AgMID=$B29)*(AgPlant=$F$2),0),19)),\"\")","v":0},{"$f":"IFERROR(IF(OR(ISNA(MATCH(TRUE,(AgPlant=$F$2),0)),ISNA(MATCH(1,(AgMID=$B29)*(AgPlant=$F$2),0))),INDEX(Aggs,MATCH(TRUE,(AgMID=$B29),0),20),INDEX(Aggs,MATCH(1,(AgMID=$B29)*(AgPlant=$F$2),0),20)),\"\")","v":0},{"$f":"IFERROR(IF(OR(ISNA(MATCH(TRUE,(AgPlant=$F$2),0)),ISNA(MATCH(1,(AgMID=$B29)*(AgPlant=$F$2),0))),INDEX(Aggs,MATCH(TRUE,(AgMID=$B29),0),21),INDEX(Aggs,MATCH(1,(AgMID=$B29)*(AgPlant=$F$2),0),21)),\"\")","v":0},{"$f":"IFERROR(IF(OR(ISNA(MATCH(TRUE,(AgPlant=$F$2),0)),ISNA(MATCH(1,(AgMID=$B29)*(AgPlant=$F$2),0))),INDEX(Aggs,MATCH(TRUE,(AgMID=$B29),0),22),INDEX(Aggs,MATCH(1,(AgMID=$B29)*(AgPlant=$F$2),0),22)),\"\")","v":0},{"$f":"IFERROR(IF(OR(ISNA(MATCH(TRUE,(AgPlant=$F$2),0)),ISNA(MATCH(1,(AgMID=$B29)*(AgPlant=$F$2),0))),INDEX(Aggs,MATCH(TRUE,(AgMID=$B29),0),23),INDEX(Aggs,MATCH(1,(AgMID=$B29)*(AgPlant=$F$2),0),23)),\"\")","v":0},{"$f":"IFERROR(IF(OR(ISNA(MATCH(TRUE,(AgPlant=$F$2),0)),ISNA(MATCH(1,(AgMID=$B29)*(AgPlant=$F$2),0))),INDEX(Aggs,MATCH(TRUE,(AgMID=$B29),0),24),INDEX(Aggs,MATCH(1,(AgMID=$B29)*(AgPlant=$F$2),0),24)),\"\")","v":0}]
[null,null,{"$f":"IFERROR(IF(OR(ISNA(MATCH(TRUE,(AgPlant=$F$2),0)),ISNA(MATCH(1,(AgMID=$B30)*(AgPlant=$F$2),0))),INDEX(Aggs,MATCH(TRUE,(AgMID=$B30),0),3),INDEX(Aggs,MATCH(1,(AgMID=$B30)*(AgPlant=$F$2),0),3)),\"\")","v":0},{"$f":"IFERROR(IF(OR(ISNA(MATCH(TRUE,(AgPlant=$F$2),0)),ISNA(MATCH(1,(AgMID=$B30)*(AgPlant=$F$2),0))),INDEX(Aggs,MATCH(TRUE,(AgMID=$B30),0),4),INDEX(Aggs,MATCH(1,(AgMID=$B30)*(AgPlant=$F$2),0),4)),\"\")","v":0},{"$f":"IFERROR(IF(OR(ISNA(MATCH(TRUE,(AgPlant=$F$2),0)),ISNA(MATCH(1,(AgMID=$B30)*(AgPlant=$F$2),0))),INDEX(Aggs,MATCH(TRUE,(AgMID=$B30),0),5),INDEX(Aggs,MATCH(1,(AgMID=$B30)*(AgPlant=$F$2),0),5)),\"\")","v":0},{"$f":"IFERROR(IF(OR(ISNA(MATCH(TRUE,(AgPlant=$F$2),0)),ISNA(MATCH(1,(AgMID=$B30)*(AgPlant=$F$2),0))),INDEX(Aggs,MATCH(TRUE,(AgMID=$B30),0),6),INDEX(Aggs,MATCH(1,(AgMID=$B30)*(AgPlant=$F$2),0),6)),\"\")","v":0},{"$f":"IFERROR(IF(OR(ISNA(MATCH(TRUE,(AgPlant=$F$2),0)),ISNA(MATCH(1,(AgMID=$B30)*(AgPlant=$F$2),0))),INDEX(Aggs,MATCH(TRUE,(AgMID=$B30),0),7),INDEX(Aggs,MATCH(1,(AgMID=$B30)*(AgPlant=$F$2),0),7)),\"\")","v":0},{"$f":"IFERROR(IF(OR(ISNA(MATCH(TRUE,(AgPlant=$F$2),0)),ISNA(MATCH(1,(AgMID=$B30)*(AgPlant=$F$2),0))),INDEX(Aggs,MATCH(TRUE,(AgMID=$B30),0),8),INDEX(Aggs,MATCH(1,(AgMID=$B30)*(AgPlant=$F$2),0),8)),\"\")","v":0},{"$f":"IFERROR(IF(OR(ISNA(MATCH(TRUE,(AgPlant=$F$2),0)),ISNA(MATCH(1,(AgMID=$B30)*(AgPlant=$F$2),0))),INDEX(Aggs,MATCH(TRUE,(AgMID=$B30),0),9),INDEX(Aggs,MATCH(1,(AgMID=$B30)*(AgPlant=$F$2),0),9)),\"\")","v":0},{"$f":"IFERROR(IF(OR(ISNA(MATCH(TRUE,(AgPlant=$F$2),0)),ISNA(MATCH(1,(AgMID=$B30)*(AgPlant=$F$2),0))),INDEX(Aggs,MATCH(TRUE,(AgMID=$B30),0),10),INDEX(Aggs,MATCH(1,(AgMID=$B30)*(AgPlant=$F$2),0),10)),\"\")","v":0},{"$f":"IFERROR(IF(OR(ISNA(MATCH(TRUE,(AgPlant=$F$2),0)),ISNA(MATCH(1,(AgMID=$B30)*(AgPlant=$F$2),0))),INDEX(Aggs,MATCH(TRUE,(AgMID=$B30),0),11),INDEX(Aggs,MATCH(1,(AgMID=$B30)*(AgPlant=$F$2),0),11)),\"\")","v":0},{"$f":"IFERROR(IF(OR(ISNA(MATCH(TRUE,(AgPlant=$F$2),0)),ISNA(MATCH(1,(AgMID=$B30)*(AgPlant=$F$2),0))),INDEX(Aggs,MATCH(TRUE,(AgMID=$B30),0),12),INDEX(Aggs,MATCH(1,(AgMID=$B30)*(AgPlant=$F$2),0),12)),\"\")","v":0},{"$f":"IFERROR(IF(OR(ISNA(MATCH(TRUE,(AgPlant=$F$2),0)),ISNA(MATCH(1,(AgMID=$B30)*(AgPlant=$F$2),0))),INDEX(Aggs,MATCH(TRUE,(AgMID=$B30),0),13),INDEX(Aggs,MATCH(1,(AgMID=$B30)*(AgPlant=$F$2),0),13)),\"\")","v":0},{"$f":"IFERROR(IF(OR(ISNA(MATCH(TRUE,(AgPlant=$F$2),0)),ISNA(MATCH(1,(AgMID=$B30)*(AgPlant=$F$2),0))),INDEX(Aggs,MATCH(TRUE,(AgMID=$B30),0),14),INDEX(Aggs,MATCH(1,(AgMID=$B30)*(AgPlant=$F$2),0),14)),\"\")","v":0},{"$f":"IFERROR(IF(OR(ISNA(MATCH(TRUE,(AgPlant=$F$2),0)),ISNA(MATCH(1,(AgMID=$B30)*(AgPlant=$F$2),0))),INDEX(Aggs,MATCH(TRUE,(AgMID=$B30),0),15),INDEX(Aggs,MATCH(1,(AgMID=$B30)*(AgPlant=$F$2),0),15)),\"\")","v":0},{"$f":"IFERROR(IF(OR(ISNA(MATCH(TRUE,(AgPlant=$F$2),0)),ISNA(MATCH(1,(AgMID=$B30)*(AgPlant=$F$2),0))),INDEX(Aggs,MATCH(TRUE,(AgMID=$B30),0),16),INDEX(Aggs,MATCH(1,(AgMID=$B30)*(AgPlant=$F$2),0),16)),\"\")","v":0},{"$f":"IFERROR(IF(OR(ISNA(MATCH(TRUE,(AgPlant=$F$2),0)),ISNA(MATCH(1,(AgMID=$B30)*(AgPlant=$F$2),0))),INDEX(Aggs,MATCH(TRUE,(AgMID=$B30),0),17),INDEX(Aggs,MATCH(1,(AgMID=$B30)*(AgPlant=$F$2),0),17)),\"\")","v":0},{"$f":"IFERROR(IF(OR(ISNA(MATCH(TRUE,(AgPlant=$F$2),0)),ISNA(MATCH(1,(AgMID=$B30)*(AgPlant=$F$2),0))),INDEX(Aggs,MATCH(TRUE,(AgMID=$B30),0),18),INDEX(Aggs,MATCH(1,(AgMID=$B30)*(AgPlant=$F$2),0),18)),\"\")","v":0},{"$f":"IFERROR(IF(OR(ISNA(MATCH(TRUE,(AgPlant=$F$2),0)),ISNA(MATCH(1,(AgMID=$B30)*(AgPlant=$F$2),0))),INDEX(Aggs,MATCH(TRUE,(AgMID=$B30),0),19),INDEX(Aggs,MATCH(1,(AgMID=$B30)*(AgPlant=$F$2),0),19)),\"\")","v":0},{"$f":"IFERROR(IF(OR(ISNA(MATCH(TRUE,(AgPlant=$F$2),0)),ISNA(MATCH(1,(AgMID=$B30)*(AgPlant=$F$2),0))),INDEX(Aggs,MATCH(TRUE,(AgMID=$B30),0),20),INDEX(Aggs,MATCH(1,(AgMID=$B30)*(AgPlant=$F$2),0),20)),\"\")","v":0},{"$f":"IFERROR(IF(OR(ISNA(MATCH(TRUE,(AgPlant=$F$2),0)),ISNA(MATCH(1,(AgMID=$B30)*(AgPlant=$F$2),0))),INDEX(Aggs,MATCH(TRUE,(AgMID=$B30),0),21),INDEX(Aggs,MATCH(1,(AgMID=$B30)*(AgPlant=$F$2),0),21)),\"\")","v":0},{"$f":"IFERROR(IF(OR(ISNA(MATCH(TRUE,(AgPlant=$F$2),0)),ISNA(MATCH(1,(AgMID=$B30)*(AgPlant=$F$2),0))),INDEX(Aggs,MATCH(TRUE,(AgMID=$B30),0),22),INDEX(Aggs,MATCH(1,(AgMID=$B30)*(AgPlant=$F$2),0),22)),\"\")","v":0},{"$f":"IFERROR(IF(OR(ISNA(MATCH(TRUE,(AgPlant=$F$2),0)),ISNA(MATCH(1,(AgMID=$B30)*(AgPlant=$F$2),0))),INDEX(Aggs,MATCH(TRUE,(AgMID=$B30),0),23),INDEX(Aggs,MATCH(1,(AgMID=$B30)*(AgPlant=$F$2),0),23)),\"\")","v":0},{"$f":"IFERROR(IF(OR(ISNA(MATCH(TRUE,(AgPlant=$F$2),0)),ISNA(MATCH(1,(AgMID=$B30)*(AgPlant=$F$2),0))),INDEX(Aggs,MATCH(TRUE,(AgMID=$B30),0),24),INDEX(Aggs,MATCH(1,(AgMID=$B30)*(AgPlant=$F$2),0),24)),\"\")","v":0}]
[null,null,{"$f":"IFERROR(IF(OR(ISNA(MATCH(TRUE,(AgPlant=$F$2),0)),ISNA(MATCH(1,(AgMID=$B31)*(AgPlant=$F$2),0))),INDEX(Aggs,MATCH(TRUE,(AgMID=$B31),0),3),INDEX(Aggs,MATCH(1,(AgMID=$B31)*(AgPlant=$F$2),0),3)),\"\")","v":0},{"$f":"IFERROR(IF(OR(ISNA(MATCH(TRUE,(AgPlant=$F$2),0)),ISNA(MATCH(1,(AgMID=$B31)*(AgPlant=$F$2),0))),INDEX(Aggs,MATCH(TRUE,(AgMID=$B31),0),4),INDEX(Aggs,MATCH(1,(AgMID=$B31)*(AgPlant=$F$2),0),4)),\"\")","v":0},{"$f":"IFERROR(IF(OR(ISNA(MATCH(TRUE,(AgPlant=$F$2),0)),ISNA(MATCH(1,(AgMID=$B31)*(AgPlant=$F$2),0))),INDEX(Aggs,MATCH(TRUE,(AgMID=$B31),0),5),INDEX(Aggs,MATCH(1,(AgMID=$B31)*(AgPlant=$F$2),0),5)),\"\")","v":0},{"$f":"IFERROR(IF(OR(ISNA(MATCH(TRUE,(AgPlant=$F$2),0)),ISNA(MATCH(1,(AgMID=$B31)*(AgPlant=$F$2),0))),INDEX(Aggs,MATCH(TRUE,(AgMID=$B31),0),6),INDEX(Aggs,MATCH(1,(AgMID=$B31)*(AgPlant=$F$2),0),6)),\"\")","v":0},{"$f":"IFERROR(IF(OR(ISNA(MATCH(TRUE,(AgPlant=$F$2),0)),ISNA(MATCH(1,(AgMID=$B31)*(AgPlant=$F$2),0))),INDEX(Aggs,MATCH(TRUE,(AgMID=$B31),0),7),INDEX(Aggs,MATCH(1,(AgMID=$B31)*(AgPlant=$F$2),0),7)),\"\")","v":0},{"$f":"IFERROR(IF(OR(ISNA(MATCH(TRUE,(AgPlant=$F$2),0)),ISNA(MATCH(1,(AgMID=$B31)*(AgPlant=$F$2),0))),INDEX(Aggs,MATCH(TRUE,(AgMID=$B31),0),8),INDEX(Aggs,MATCH(1,(AgMID=$B31)*(AgPlant=$F$2),0),8)),\"\")","v":0},{"$f":"IFERROR(IF(OR(ISNA(MATCH(TRUE,(AgPlant=$F$2),0)),ISNA(MATCH(1,(AgMID=$B31)*(AgPlant=$F$2),0))),INDEX(Aggs,MATCH(TRUE,(AgMID=$B31),0),9),INDEX(Aggs,MATCH(1,(AgMID=$B31)*(AgPlant=$F$2),0),9)),\"\")","v":0},{"$f":"IFERROR(IF(OR(ISNA(MATCH(TRUE,(AgPlant=$F$2),0)),ISNA(MATCH(1,(AgMID=$B31)*(AgPlant=$F$2),0))),INDEX(Aggs,MATCH(TRUE,(AgMID=$B31),0),10),INDEX(Aggs,MATCH(1,(AgMID=$B31)*(AgPlant=$F$2),0),10)),\"\")","v":0},{"$f":"IFERROR(IF(OR(ISNA(MATCH(TRUE,(AgPlant=$F$2),0)),ISNA(MATCH(1,(AgMID=$B31)*(AgPlant=$F$2),0))),INDEX(Aggs,MATCH(TRUE,(AgMID=$B31),0),11),INDEX(Aggs,MATCH(1,(AgMID=$B31)*(AgPlant=$F$2),0),11)),\"\")","v":0},{"$f":"IFERROR(IF(OR(ISNA(MATCH(TRUE,(AgPlant=$F$2),0)),ISNA(MATCH(1,(AgMID=$B31)*(AgPlant=$F$2),0))),INDEX(Aggs,MATCH(TRUE,(AgMID=$B31),0),12),INDEX(Aggs,MATCH(1,(AgMID=$B31)*(AgPlant=$F$2),0),12)),\"\")","v":0},{"$f":"IFERROR(IF(OR(ISNA(MATCH(TRUE,(AgPlant=$F$2),0)),ISNA(MATCH(1,(AgMID=$B31)*(AgPlant=$F$2),0))),INDEX(Aggs,MATCH(TRUE,(AgMID=$B31),0),13),INDEX(Aggs,MATCH(1,(AgMID=$B31)*(AgPlant=$F$2),0),13)),\"\")","v":0},{"$f":"IFERROR(IF(OR(ISNA(MATCH(TRUE,(AgPlant=$F$2),0)),ISNA(MATCH(1,(AgMID=$B31)*(AgPlant=$F$2),0))),INDEX(Aggs,MATCH(TRUE,(AgMID=$B31),0),14),INDEX(Aggs,MATCH(1,(AgMID=$B31)*(AgPlant=$F$2),0),14)),\"\")","v":0},{"$f":"IFERROR(IF(OR(ISNA(MATCH(TRUE,(AgPlant=$F$2),0)),ISNA(MATCH(1,(AgMID=$B31)*(AgPlant=$F$2),0))),INDEX(Aggs,MATCH(TRUE,(AgMID=$B31),0),15),INDEX(Aggs,MATCH(1,(AgMID=$B31)*(AgPlant=$F$2),0),15)),\"\")","v":0},{"$f":"IFERROR(IF(OR(ISNA(MATCH(TRUE,(AgPlant=$F$2),0)),ISNA(MATCH(1,(AgMID=$B31)*(AgPlant=$F$2),0))),INDEX(Aggs,MATCH(TRUE,(AgMID=$B31),0),16),INDEX(Aggs,MATCH(1,(AgMID=$B31)*(AgPlant=$F$2),0),16)),\"\")","v":0},{"$f":"IFERROR(IF(OR(ISNA(MATCH(TRUE,(AgPlant=$F$2),0)),ISNA(MATCH(1,(AgMID=$B31)*(AgPlant=$F$2),0))),INDEX(Aggs,MATCH(TRUE,(AgMID=$B31),0),17),INDEX(Aggs,MATCH(1,(AgMID=$B31)*(AgPlant=$F$2),0),17)),\"\")","v":0},{"$f":"IFERROR(IF(OR(ISNA(MATCH(TRUE,(AgPlant=$F$2),0)),ISNA(MATCH(1,(AgMID=$B31)*(AgPlant=$F$2),0))),INDEX(Aggs,MATCH(TRUE,(AgMID=$B31),0),18),INDEX(Aggs,MATCH(1,(AgMID=$B31)*(AgPlant=$F$2),0),18)),\"\")","v":0},{"$f":"IFERROR(IF(OR(ISNA(MATCH(TRUE,(AgPlant=$F$2),0)),ISNA(MATCH(1,(AgMID=$B31)*(AgPlant=$F$2),0))),INDEX(Aggs,MATCH(TRUE,(AgMID=$B31),0),19),INDEX(Aggs,MATCH(1,(AgMID=$B31)*(AgPlant=$F$2),0),19)),\"\")","v":0},{"$f":"IFERROR(IF(OR(ISNA(MATCH(TRUE,(AgPlant=$F$2),0)),ISNA(MATCH(1,(AgMID=$B31)*(AgPlant=$F$2),0))),INDEX(Aggs,MATCH(TRUE,(AgMID=$B31),0),20),INDEX(Aggs,MATCH(1,(AgMID=$B31)*(AgPlant=$F$2),0),20)),\"\")","v":0},{"$f":"IFERROR(IF(OR(ISNA(MATCH(TRUE,(AgPlant=$F$2),0)),ISNA(MATCH(1,(AgMID=$B31)*(AgPlant=$F$2),0))),INDEX(Aggs,MATCH(TRUE,(AgMID=$B31),0),21),INDEX(Aggs,MATCH(1,(AgMID=$B31)*(AgPlant=$F$2),0),21)),\"\")","v":0},{"$f":"IFERROR(IF(OR(ISNA(MATCH(TRUE,(AgPlant=$F$2),0)),ISNA(MATCH(1,(AgMID=$B31)*(AgPlant=$F$2),0))),INDEX(Aggs,MATCH(TRUE,(AgMID=$B31),0),22),INDEX(Aggs,MATCH(1,(AgMID=$B31)*(AgPlant=$F$2),0),22)),\"\")","v":0},{"$f":"IFERROR(IF(OR(ISNA(MATCH(TRUE,(AgPlant=$F$2),0)),ISNA(MATCH(1,(AgMID=$B31)*(AgPlant=$F$2),0))),INDEX(Aggs,MATCH(TRUE,(AgMID=$B31),0),23),INDEX(Aggs,MATCH(1,(AgMID=$B31)*(AgPlant=$F$2),0),23)),\"\")","v":0},{"$f":"IFERROR(IF(OR(ISNA(MATCH(TRUE,(AgPlant=$F$2),0)),ISNA(MATCH(1,(AgMID=$B31)*(AgPlant=$F$2),0))),INDEX(Aggs,MATCH(TRUE,(AgMID=$B31),0),24),INDEX(Aggs,MATCH(1,(AgMID=$B31)*(AgPlant=$F$2),0),24)),\"\")","v":0}]
[null,null,{"$f":"IFERROR(IF(OR(ISNA(MATCH(TRUE,(AgPlant=$F$2),0)),ISNA(MATCH(1,(AgMID=$B32)*(AgPlant=$F$2),0))),INDEX(Aggs,MATCH(TRUE,(AgMID=$B32),0),3),INDEX(Aggs,MATCH(1,(AgMID=$B32)*(AgPlant=$F$2),0),3)),\"\")","v":0},{"$f":"IFERROR(IF(OR(ISNA(MATCH(TRUE,(AgPlant=$F$2),0)),ISNA(MATCH(1,(AgMID=$B32)*(AgPlant=$F$2),0))),INDEX(Aggs,MATCH(TRUE,(AgMID=$B32),0),4),INDEX(Aggs,MATCH(1,(AgMID=$B32)*(AgPlant=$F$2),0),4)),\"\")","v":0},{"$f":"IFERROR(IF(OR(ISNA(MATCH(TRUE,(AgPlant=$F$2),0)),ISNA(MATCH(1,(AgMID=$B32)*(AgPlant=$F$2),0))),INDEX(Aggs,MATCH(TRUE,(AgMID=$B32),0),5),INDEX(Aggs,MATCH(1,(AgMID=$B32)*(AgPlant=$F$2),0),5)),\"\")","v":0},{"$f":"IFERROR(IF(OR(ISNA(MATCH(TRUE,(AgPlant=$F$2),0)),ISNA(MATCH(1,(AgMID=$B32)*(AgPlant=$F$2),0))),INDEX(Aggs,MATCH(TRUE,(AgMID=$B32),0),6),INDEX(Aggs,MATCH(1,(AgMID=$B32)*(AgPlant=$F$2),0),6)),\"\")","v":0},{"$f":"IFERROR(IF(OR(ISNA(MATCH(TRUE,(AgPlant=$F$2),0)),ISNA(MATCH(1,(AgMID=$B32)*(AgPlant=$F$2),0))),INDEX(Aggs,MATCH(TRUE,(AgMID=$B32),0),7),INDEX(Aggs,MATCH(1,(AgMID=$B32)*(AgPlant=$F$2),0),7)),\"\")","v":0},{"$f":"IFERROR(IF(OR(ISNA(MATCH(TRUE,(AgPlant=$F$2),0)),ISNA(MATCH(1,(AgMID=$B32)*(AgPlant=$F$2),0))),INDEX(Aggs,MATCH(TRUE,(AgMID=$B32),0),8),INDEX(Aggs,MATCH(1,(AgMID=$B32)*(AgPlant=$F$2),0),8)),\"\")","v":0},{"$f":"IFERROR(IF(OR(ISNA(MATCH(TRUE,(AgPlant=$F$2),0)),ISNA(MATCH(1,(AgMID=$B32)*(AgPlant=$F$2),0))),INDEX(Aggs,MATCH(TRUE,(AgMID=$B32),0),9),INDEX(Aggs,MATCH(1,(AgMID=$B32)*(AgPlant=$F$2),0),9)),\"\")","v":0},{"$f":"IFERROR(IF(OR(ISNA(MATCH(TRUE,(AgPlant=$F$2),0)),ISNA(MATCH(1,(AgMID=$B32)*(AgPlant=$F$2),0))),INDEX(Aggs,MATCH(TRUE,(AgMID=$B32),0),10),INDEX(Aggs,MATCH(1,(AgMID=$B32)*(AgPlant=$F$2),0),10)),\"\")","v":0},{"$f":"IFERROR(IF(OR(ISNA(MATCH(TRUE,(AgPlant=$F$2),0)),ISNA(MATCH(1,(AgMID=$B32)*(AgPlant=$F$2),0))),INDEX(Aggs,MATCH(TRUE,(AgMID=$B32),0),11),INDEX(Aggs,MATCH(1,(AgMID=$B32)*(AgPlant=$F$2),0),11)),\"\")","v":0},{"$f":"IFERROR(IF(OR(ISNA(MATCH(TRUE,(AgPlant=$F$2),0)),ISNA(MATCH(1,(AgMID=$B32)*(AgPlant=$F$2),0))),INDEX(Aggs,MATCH(TRUE,(AgMID=$B32),0),12),INDEX(Aggs,MATCH(1,(AgMID=$B32)*(AgPlant=$F$2),0),12)),\"\")","v":0},{"$f":"IFERROR(IF(OR(ISNA(MATCH(TRUE,(AgPlant=$F$2),0)),ISNA(MATCH(1,(AgMID=$B32)*(AgPlant=$F$2),0))),INDEX(Aggs,MATCH(TRUE,(AgMID=$B32),0),13),INDEX(Aggs,MATCH(1,(AgMID=$B32)*(AgPlant=$F$2),0),13)),\"\")","v":0},{"$f":"IFERROR(IF(OR(ISNA(MATCH(TRUE,(AgPlant=$F$2),0)),ISNA(MATCH(1,(AgMID=$B32)*(AgPlant=$F$2),0))),INDEX(Aggs,MATCH(TRUE,(AgMID=$B32),0),14),INDEX(Aggs,MATCH(1,(AgMID=$B32)*(AgPlant=$F$2),0),14)),\"\")","v":0},{"$f":"IFERROR(IF(OR(ISNA(MATCH(TRUE,(AgPlant=$F$2),0)),ISNA(MATCH(1,(AgMID=$B32)*(AgPlant=$F$2),0))),INDEX(Aggs,MATCH(TRUE,(AgMID=$B32),0),15),INDEX(Aggs,MATCH(1,(AgMID=$B32)*(AgPlant=$F$2),0),15)),\"\")","v":0},{"$f":"IFERROR(IF(OR(ISNA(MATCH(TRUE,(AgPlant=$F$2),0)),ISNA(MATCH(1,(AgMID=$B32)*(AgPlant=$F$2),0))),INDEX(Aggs,MATCH(TRUE,(AgMID=$B32),0),16),INDEX(Aggs,MATCH(1,(AgMID=$B32)*(AgPlant=$F$2),0),16)),\"\")","v":0},{"$f":"IFERROR(IF(OR(ISNA(MATCH(TRUE,(AgPlant=$F$2),0)),ISNA(MATCH(1,(AgMID=$B32)*(AgPlant=$F$2),0))),INDEX(Aggs,MATCH(TRUE,(AgMID=$B32),0),17),INDEX(Aggs,MATCH(1,(AgMID=$B32)*(AgPlant=$F$2),0),17)),\"\")","v":0},{"$f":"IFERROR(IF(OR(ISNA(MATCH(TRUE,(AgPlant=$F$2),0)),ISNA(MATCH(1,(AgMID=$B32)*(AgPlant=$F$2),0))),INDEX(Aggs,MATCH(TRUE,(AgMID=$B32),0),18),INDEX(Aggs,MATCH(1,(AgMID=$B32)*(AgPlant=$F$2),0),18)),\"\")","v":0},{"$f":"IFERROR(IF(OR(ISNA(MATCH(TRUE,(AgPlant=$F$2),0)),ISNA(MATCH(1,(AgMID=$B32)*(AgPlant=$F$2),0))),INDEX(Aggs,MATCH(TRUE,(AgMID=$B32),0),19),INDEX(Aggs,MATCH(1,(AgMID=$B32)*(AgPlant=$F$2),0),19)),\"\")","v":0},{"$f":"IFERROR(IF(OR(ISNA(MATCH(TRUE,(AgPlant=$F$2),0)),ISNA(MATCH(1,(AgMID=$B32)*(AgPlant=$F$2),0))),INDEX(Aggs,MATCH(TRUE,(AgMID=$B32),0),20),INDEX(Aggs,MATCH(1,(AgMID=$B32)*(AgPlant=$F$2),0),20)),\"\")","v":0},{"$f":"IFERROR(IF(OR(ISNA(MATCH(TRUE,(AgPlant=$F$2),0)),ISNA(MATCH(1,(AgMID=$B32)*(AgPlant=$F$2),0))),INDEX(Aggs,MATCH(TRUE,(AgMID=$B32),0),21),INDEX(Aggs,MATCH(1,(AgMID=$B32)*(AgPlant=$F$2),0),21)),\"\")","v":0},{"$f":"IFERROR(IF(OR(ISNA(MATCH(TRUE,(AgPlant=$F$2),0)),ISNA(MATCH(1,(AgMID=$B32)*(AgPlant=$F$2),0))),INDEX(Aggs,MATCH(TRUE,(AgMID=$B32),0),22),INDEX(Aggs,MATCH(1,(AgMID=$B32)*(AgPlant=$F$2),0),22)),\"\")","v":0},{"$f":"IFERROR(IF(OR(ISNA(MATCH(TRUE,(AgPlant=$F$2),0)),ISNA(MATCH(1,(AgMID=$B32)*(AgPlant=$F$2),0))),INDEX(Aggs,MATCH(TRUE,(AgMID=$B32),0),23),INDEX(Aggs,MATCH(1,(AgMID=$B32)*(AgPlant=$F$2),0),23)),\"\")","v":0},{"$f":"IFERROR(IF(OR(ISNA(MATCH(TRUE,(AgPlant=$F$2),0)),ISNA(MATCH(1,(AgMID=$B32)*(AgPlant=$F$2),0))),INDEX(Aggs,MATCH(TRUE,(AgMID=$B32),0),24),INDEX(Aggs,MATCH(1,(AgMID=$B32)*(AgPlant=$F$2),0),24)),\"\")","v":0}]
[null,"FINE AGGREGATE",null,null,null,null,null,null,null,null,null,"2\"","1 1/2\"","1\"","3/4\"","1/2\"","3/8\"","#4","#8","#16","#30","#50","#100","#200"]
[null,"Material ID ↓","Source","Location","Formation","Ledge(s)","Source ID","Size","Grading","% Chert","Non-Polish",50,37.5,25,19,12.5,9.5,4.75,2.36,1.18,0.6,0.3,0.15,7.4999999999999997E-2]
[null,null,{"$f":"IFERROR(IF(OR(ISNA(MATCH(TRUE,(AgPlant=$F$2),0)),ISNA(MATCH(1,(AgMID=$B35)*(AgPlant=$F$2),0))),INDEX(Aggs,MATCH(TRUE,(AgMID=$B35),0),3),INDEX(Aggs,MATCH(1,(AgMID=$B35)*(AgPlant=$F$2),0),3)),\"\")","v":0},{"$f":"IFERROR(IF(OR(ISNA(MATCH(TRUE,(AgPlant=$F$2),0)),ISNA(MATCH(1,(AgMID=$B35)*(AgPlant=$F$2),0))),INDEX(Aggs,MATCH(TRUE,(AgMID=$B35),0),4),INDEX(Aggs,MATCH(1,(AgMID=$B35)*(AgPlant=$F$2),0),4)),\"\")","v":0},{"$f":"IFERROR(IF(OR(ISNA(MATCH(TRUE,(AgPlant=$F$2),0)),ISNA(MATCH(1,(AgMID=$B35)*(AgPlant=$F$2),0))),INDEX(Aggs,MATCH(TRUE,(AgMID=$B35),0),5),INDEX(Aggs,MATCH(1,(AgMID=$B35)*(AgPlant=$F$2),0),5)),\"\")","v":0},{"$f":"IFERROR(IF(OR(ISNA(MATCH(TRUE,(AgPlant=$F$2),0)),ISNA(MATCH(1,(AgMID=$B35)*(AgPlant=$F$2),0))),INDEX(Aggs,MATCH(TRUE,(AgMID=$B35),0),6),INDEX(Aggs,MATCH(1,(AgMID=$B35)*(AgPlant=$F$2),0),6)),\"\")","v":0},{"$f":"IFERROR(IF(OR(ISNA(MATCH(TRUE,(AgPlant=$F$2),0)),ISNA(MATCH(1,(AgMID=$B35)*(AgPlant=$F$2),0))),INDEX(Aggs,MATCH(TRUE,(AgMID=$B35),0),7),INDEX(Aggs,MATCH(1,(AgMID=$B35)*(AgPlant=$F$2),0),7)),\"\")","v":0},{"$f":"IFERROR(IF(OR(ISNA(MATCH(TRUE,(AgPlant=$F$2),0)),ISNA(MATCH(1,(AgMID=$B35)*(AgPlant=$F$2),0))),INDEX(Aggs,MATCH(TRUE,(AgMID=$B35),0),8),INDEX(Aggs,MATCH(1,(AgMID=$B35)*(AgPlant=$F$2),0),8)),\"\")","v":0},{"$f":"IFERROR(IF(OR(ISNA(MATCH(TRUE,(AgPlant=$F$2),0)),ISNA(MATCH(1,(AgMID=$B35)*(AgPlant=$F$2),0))),INDEX(Aggs,MATCH(TRUE,(AgMID=$B35),0),9),INDEX(Aggs,MATCH(1,(AgMID=$B35)*(AgPlant=$F$2),0),9)),\"\")","v":0},{"$f":"IFERROR(IF(OR(ISNA(MATCH(TRUE,(AgPlant=$F$2),0)),ISNA(MATCH(1,(AgMID=$B35)*(AgPlant=$F$2),0))),INDEX(Aggs,MATCH(TRUE,(AgMID=$B35),0),10),INDEX(Aggs,MATCH(1,(AgMID=$B35)*(AgPlant=$F$2),0),10)),\"\")","v":0},{"$f":"IFERROR(IF(OR(ISNA(MATCH(TRUE,(AgPlant=$F$2),0)),ISNA(MATCH(1,(AgMID=$B35)*(AgPlant=$F$2),0))),INDEX(Aggs,MATCH(TRUE,(AgMID=$B35),0),11),INDEX(Aggs,MATCH(1,(AgMID=$B35)*(AgPlant=$F$2),0),11)),\"\")","v":0},{"$f":"IFERROR(IF(OR(ISNA(MATCH(TRUE,(AgPlant=$F$2),0)),ISNA(MATCH(1,(AgMID=$B35)*(AgPlant=$F$2),0))),INDEX(Aggs,MATCH(TRUE,(AgMID=$B35),0),12),INDEX(Aggs,MATCH(1,(AgMID=$B35)*(AgPlant=$F$2),0),12)),\"\")","v":0},{"$f":"IFERROR(IF(OR(ISNA(MATCH(TRUE,(AgPlant=$F$2),0)),ISNA(MATCH(1,(AgMID=$B35)*(AgPlant=$F$2),0))),INDEX(Aggs,MATCH(TRUE,(AgMID=$B35),0),13),INDEX(Aggs,MATCH(1,(AgMID=$B35)*(AgPlant=$F$2),0),13)),\"\")","v":0},{"$f":"IFERROR(IF(OR(ISNA(MATCH(TRUE,(AgPlant=$F$2),0)),ISNA(MATCH(1,(AgMID=$B35)*(AgPlant=$F$2),0))),INDEX(Aggs,MATCH(TRUE,(AgMID=$B35),0),14),INDEX(Aggs,MATCH(1,(AgMID=$B35)*(AgPlant=$F$2),0),14)),\"\")","v":0},{"$f":"IFERROR(IF(OR(ISNA(MATCH(TRUE,(AgPlant=$F$2),0)),ISNA(MATCH(1,(AgMID=$B35)*(AgPlant=$F$2),0))),INDEX(Aggs,MATCH(TRUE,(AgMID=$B35),0),15),INDEX(Aggs,MATCH(1,(AgMID=$B35)*(AgPlant=$F$2),0),15)),\"\")","v":0},{"$f":"IFERROR(IF(OR(ISNA(MATCH(TRUE,(AgPlant=$F$2),0)),ISNA(MATCH(1,(AgMID=$B35)*(AgPlant=$F$2),0))),INDEX(Aggs,MATCH(TRUE,(AgMID=$B35),0),16),INDEX(Aggs,MATCH(1,(AgMID=$B35)*(AgPlant=$F$2),0),16)),\"\")","v":0},{"$f":"IFERROR(IF(OR(ISNA(MATCH(TRUE,(AgPlant=$F$2),0)),ISNA(MATCH(1,(AgMID=$B35)*(AgPlant=$F$2),0))),INDEX(Aggs,MATCH(TRUE,(AgMID=$B35),0),17),INDEX(Aggs,MATCH(1,(AgMID=$B35)*(AgPlant=$F$2),0),17)),\"\")","v":0},{"$f":"IFERROR(IF(OR(ISNA(MATCH(TRUE,(AgPlant=$F$2),0)),ISNA(MATCH(1,(AgMID=$B35)*(AgPlant=$F$2),0))),INDEX(Aggs,MATCH(TRUE,(AgMID=$B35),0),18),INDEX(Aggs,MATCH(1,(AgMID=$B35)*(AgPlant=$F$2),0),18)),\"\")","v":0},{"$f":"IFERROR(IF(OR(ISNA(MATCH(TRUE,(AgPlant=$F$2),0)),ISNA(MATCH(1,(AgMID=$B35)*(AgPlant=$F$2),0))),INDEX(Aggs,MATCH(TRUE,(AgMID=$B35),0),19),INDEX(Aggs,MATCH(1,(AgMID=$B35)*(AgPlant=$F$2),0),19)),\"\")","v":0},{"$f":"IFERROR(IF(OR(ISNA(MATCH(TRUE,(AgPlant=$F$2),0)),ISNA(MATCH(1,(AgMID=$B35)*(AgPlant=$F$2),0))),INDEX(Aggs,MATCH(TRUE,(AgMID=$B35),0),20),INDEX(Aggs,MATCH(1,(AgMID=$B35)*(AgPlant=$F$2),0),20)),\"\")","v":0},{"$f":"IFERROR(IF(OR(ISNA(MATCH(TRUE,(AgPlant=$F$2),0)),ISNA(MATCH(1,(AgMID=$B35)*(AgPlant=$F$2),0))),INDEX(Aggs,MATCH(TRUE,(AgMID=$B35),0),21),INDEX(Aggs,MATCH(1,(AgMID=$B35)*(AgPlant=$F$2),0),21)),\"\")","v":0},{"$f":"IFERROR(IF(OR(ISNA(MATCH(TRUE,(AgPlant=$F$2),0)),ISNA(MATCH(1,(AgMID=$B35)*(AgPlant=$F$2),0))),INDEX(Aggs,MATCH(TRUE,(AgMID=$B35),0),22),INDEX(Aggs,MATCH(1,(AgMID=$B35)*(AgPlant=$F$2),0),22)),\"\")","v":0},{"$f":"IFERROR(IF(OR(ISNA(MATCH(TRUE,(AgPlant=$F$2),0)),ISNA(MATCH(1,(AgMID=$B35)*(AgPlant=$F$2),0))),INDEX(Aggs,MATCH(TRUE,(AgMID=$B35),0),23),INDEX(Aggs,MATCH(1,(AgMID=$B35)*(AgPlant=$F$2),0),23)),\"\")","v":0},{"$f":"IFERROR(IF(OR(ISNA(MATCH(TRUE,(AgPlant=$F$2),0)),ISNA(MATCH(1,(AgMID=$B35)*(AgPlant=$F$2),0))),INDEX(Aggs,MATCH(TRUE,(AgMID=$B35),0),24),INDEX(Aggs,MATCH(1,(AgMID=$B35)*(AgPlant=$F$2),0),24)),\"\")","v":0}]
[null,null,{"$f":"IFERROR(IF(OR(ISNA(MATCH(TRUE,(AgPlant=$F$2),0)),ISNA(MATCH(1,(AgMID=$B36)*(AgPlant=$F$2),0))),INDEX(Aggs,MATCH(TRUE,(AgMID=$B36),0),3),INDEX(Aggs,MATCH(1,(AgMID=$B36)*(AgPlant=$F$2),0),3)),\"\")","v":0},{"$f":"IFERROR(IF(OR(ISNA(MATCH(TRUE,(AgPlant=$F$2),0)),ISNA(MATCH(1,(AgMID=$B36)*(AgPlant=$F$2),0))),INDEX(Aggs,MATCH(TRUE,(AgMID=$B36),0),4),INDEX(Aggs,MATCH(1,(AgMID=$B36)*(AgPlant=$F$2),0),4)),\"\")","v":0},{"$f":"IFERROR(IF(OR(ISNA(MATCH(TRUE,(AgPlant=$F$2),0)),ISNA(MATCH(1,(AgMID=$B36)*(AgPlant=$F$2),0))),INDEX(Aggs,MATCH(TRUE,(AgMID=$B36),0),5),INDEX(Aggs,MATCH(1,(AgMID=$B36)*(AgPlant=$F$2),0),5)),\"\")","v":0},{"$f":"IFERROR(IF(OR(ISNA(MATCH(TRUE,(AgPlant=$F$2),0)),ISNA(MATCH(1,(AgMID=$B36)*(AgPlant=$F$2),0))),INDEX(Aggs,MATCH(TRUE,(AgMID=$B36),0),6),INDEX(Aggs,MATCH(1,(AgMID=$B36)*(AgPlant=$F$2),0),6)),\"\")","v":0},{"$f":"IFERROR(IF(OR(ISNA(MATCH(TRUE,(AgPlant=$F$2),0)),ISNA(MATCH(1,(AgMID=$B36)*(AgPlant=$F$2),0))),INDEX(Aggs,MATCH(TRUE,(AgMID=$B36),0),7),INDEX(Aggs,MATCH(1,(AgMID=$B36)*(AgPlant=$F$2),0),7)),\"\")","v":0},{"$f":"IFERROR(IF(OR(ISNA(MATCH(TRUE,(AgPlant=$F$2),0)),ISNA(MATCH(1,(AgMID=$B36)*(AgPlant=$F$2),0))),INDEX(Aggs,MATCH(TRUE,(AgMID=$B36),0),8),INDEX(Aggs,MATCH(1,(AgMID=$B36)*(AgPlant=$F$2),0),8)),\"\")","v":0},{"$f":"IFERROR(IF(OR(ISNA(MATCH(TRUE,(AgPlant=$F$2),0)),ISNA(MATCH(1,(AgMID=$B36)*(AgPlant=$F$2),0))),INDEX(Aggs,MATCH(TRUE,(AgMID=$B36),0),9),INDEX(Aggs,MATCH(1,(AgMID=$B36)*(AgPlant=$F$2),0),9)),\"\")","v":0},{"$f":"IFERROR(IF(OR(ISNA(MATCH(TRUE,(AgPlant=$F$2),0)),ISNA(MATCH(1,(AgMID=$B36)*(AgPlant=$F$2),0))),INDEX(Aggs,MATCH(TRUE,(AgMID=$B36),0),10),INDEX(Aggs,MATCH(1,(AgMID=$B36)*(AgPlant=$F$2),0),10)),\"\")","v":0},{"$f":"IFERROR(IF(OR(ISNA(MATCH(TRUE,(AgPlant=$F$2),0)),ISNA(MATCH(1,(AgMID=$B36)*(AgPlant=$F$2),0))),INDEX(Aggs,MATCH(TRUE,(AgMID=$B36),0),11),INDEX(Aggs,MATCH(1,(AgMID=$B36)*(AgPlant=$F$2),0),11)),\"\")","v":0},{"$f":"IFERROR(IF(OR(ISNA(MATCH(TRUE,(AgPlant=$F$2),0)),ISNA(MATCH(1,(AgMID=$B36)*(AgPlant=$F$2),0))),INDEX(Aggs,MATCH(TRUE,(AgMID=$B36),0),12),INDEX(Aggs,MATCH(1,(AgMID=$B36)*(AgPlant=$F$2),0),12)),\"\")","v":0},{"$f":"IFERROR(IF(OR(ISNA(MATCH(TRUE,(AgPlant=$F$2),0)),ISNA(MATCH(1,(AgMID=$B36)*(AgPlant=$F$2),0))),INDEX(Aggs,MATCH(TRUE,(AgMID=$B36),0),13),INDEX(Aggs,MATCH(1,(AgMID=$B36)*(AgPlant=$F$2),0),13)),\"\")","v":0},{"$f":"IFERROR(IF(OR(ISNA(MATCH(TRUE,(AgPlant=$F$2),0)),ISNA(MATCH(1,(AgMID=$B36)*(AgPlant=$F$2),0))),INDEX(Aggs,MATCH(TRUE,(AgMID=$B36),0),14),INDEX(Aggs,MATCH(1,(AgMID=$B36)*(AgPlant=$F$2),0),14)),\"\")","v":0},{"$f":"IFERROR(IF(OR(ISNA(MATCH(TRUE,(AgPlant=$F$2),0)),ISNA(MATCH(1,(AgMID=$B36)*(AgPlant=$F$2),0))),INDEX(Aggs,MATCH(TRUE,(AgMID=$B36),0),15),INDEX(Aggs,MATCH(1,(AgMID=$B36)*(AgPlant=$F$2),0),15)),\"\")","v":0},{"$f":"IFERROR(IF(OR(ISNA(MATCH(TRUE,(AgPlant=$F$2),0)),ISNA(MATCH(1,(AgMID=$B36)*(AgPlant=$F$2),0))),INDEX(Aggs,MATCH(TRUE,(AgMID=$B36),0),16),INDEX(Aggs,MATCH(1,(AgMID=$B36)*(AgPlant=$F$2),0),16)),\"\")","v":0},{"$f":"IFERROR(IF(OR(ISNA(MATCH(TRUE,(AgPlant=$F$2),0)),ISNA(MATCH(1,(AgMID=$B36)*(AgPlant=$F$2),0))),INDEX(Aggs,MATCH(TRUE,(AgMID=$B36),0),17),INDEX(Aggs,MATCH(1,(AgMID=$B36)*(AgPlant=$F$2),0),17)),\"\")","v":0},{"$f":"IFERROR(IF(OR(ISNA(MATCH(TRUE,(AgPlant=$F$2),0)),ISNA(MATCH(1,(AgMID=$B36)*(AgPlant=$F$2),0))),INDEX(Aggs,MATCH(TRUE,(AgMID=$B36),0),18),INDEX(Aggs,MATCH(1,(AgMID=$B36)*(AgPlant=$F$2),0),18)),\"\")","v":0},{"$f":"IFERROR(IF(OR(ISNA(MATCH(TRUE,(AgPlant=$F$2),0)),ISNA(MATCH(1,(AgMID=$B36)*(AgPlant=$F$2),0))),INDEX(Aggs,MATCH(TRUE,(AgMID=$B36),0),19),INDEX(Aggs,MATCH(1,(AgMID=$B36)*(AgPlant=$F$2),0),19)),\"\")","v":0},{"$f":"IFERROR(IF(OR(ISNA(MATCH(TRUE,(AgPlant=$F$2),0)),ISNA(MATCH(1,(AgMID=$B36)*(AgPlant=$F$2),0))),INDEX(Aggs,MATCH(TRUE,(AgMID=$B36),0),20),INDEX(Aggs,MATCH(1,(AgMID=$B36)*(AgPlant=$F$2),0),20)),\"\")","v":0},{"$f":"IFERROR(IF(OR(ISNA(MATCH(TRUE,(AgPlant=$F$2),0)),ISNA(MATCH(1,(AgMID=$B36)*(AgPlant=$F$2),0))),INDEX(Aggs,MATCH(TRUE,(AgMID=$B36),0),21),INDEX(Aggs,MATCH(1,(AgMID=$B36)*(AgPlant=$F$2),0),21)),\"\")","v":0},{"$f":"IFERROR(IF(OR(ISNA(MATCH(TRUE,(AgPlant=$F$2),0)),ISNA(MATCH(1,(AgMID=$B36)*(AgPlant=$F$2),0))),INDEX(Aggs,MATCH(TRUE,(AgMID=$B36),0),22),INDEX(Aggs,MATCH(1,(AgMID=$B36)*(AgPlant=$F$2),0),22)),\"\")","v":0},{"$f":"IFERROR(IF(OR(ISNA(MATCH(TRUE,(AgPlant=$F$2),0)),ISNA(MATCH(1,(AgMID=$B36)*(AgPlant=$F$2),0))),INDEX(Aggs,MATCH(TRUE,(AgMID=$B36),0),23),INDEX(Aggs,MATCH(1,(AgMID=$B36)*(AgPlant=$F$2),0),23)),\"\")","v":0},{"$f":"IFERROR(IF(OR(ISNA(MATCH(TRUE,(AgPlant=$F$2),0)),ISNA(MATCH(1,(AgMID=$B36)*(AgPlant=$F$2),0))),INDEX(Aggs,MATCH(TRUE,(AgMID=$B36),0),24),INDEX(Aggs,MATCH(1,(AgMID=$B36)*(AgPlant=$F$2),0),24)),\"\")","v":0}]
[null,null,{"$f":"IFERROR(IF(OR(ISNA(MATCH(TRUE,(AgPlant=$F$2),0)),ISNA(MATCH(1,(AgMID=$B37)*(AgPlant=$F$2),0))),INDEX(Aggs,MATCH(TRUE,(AgMID=$B37),0),3),INDEX(Aggs,MATCH(1,(AgMID=$B37)*(AgPlant=$F$2),0),3)),\"\")","v":0},{"$f":"IFERROR(IF(OR(ISNA(MATCH(TRUE,(AgPlant=$F$2),0)),ISNA(MATCH(1,(AgMID=$B37)*(AgPlant=$F$2),0))),INDEX(Aggs,MATCH(TRUE,(AgMID=$B37),0),4),INDEX(Aggs,MATCH(1,(AgMID=$B37)*(AgPlant=$F$2),0),4)),\"\")","v":0},{"$f":"IFERROR(IF(OR(ISNA(MATCH(TRUE,(AgPlant=$F$2),0)),ISNA(MATCH(1,(AgMID=$B37)*(AgPlant=$F$2),0))),INDEX(Aggs,MATCH(TRUE,(AgMID=$B37),0),5),INDEX(Aggs,MATCH(1,(AgMID=$B37)*(AgPlant=$F$2),0),5)),\"\")","v":0},{"$f":"IFERROR(IF(OR(ISNA(MATCH(TRUE,(AgPlant=$F$2),0)),ISNA(MATCH(1,(AgMID=$B37)*(AgPlant=$F$2),0))),INDEX(Aggs,MATCH(TRUE,(AgMID=$B37),0),6),INDEX(Aggs,MATCH(1,(AgMID=$B37)*(AgPlant=$F$2),0),6)),\"\")","v":0},{"$f":"IFERROR(IF(OR(ISNA(MATCH(TRUE,(AgPlant=$F$2),0)),ISNA(MATCH(1,(AgMID=$B37)*(AgPlant=$F$2),0))),INDEX(Aggs,MATCH(TRUE,(AgMID=$B37),0),7),INDEX(Aggs,MATCH(1,(AgMID=$B37)*(AgPlant=$F$2),0),7)),\"\")","v":0},{"$f":"IFERROR(IF(OR(ISNA(MATCH(TRUE,(AgPlant=$F$2),0)),ISNA(MATCH(1,(AgMID=$B37)*(AgPlant=$F$2),0))),INDEX(Aggs,MATCH(TRUE,(AgMID=$B37),0),8),INDEX(Aggs,MATCH(1,(AgMID=$B37)*(AgPlant=$F$2),0),8)),\"\")","v":0},{"$f":"IFERROR(IF(OR(ISNA(MATCH(TRUE,(AgPlant=$F$2),0)),ISNA(MATCH(1,(AgMID=$B37)*(AgPlant=$F$2),0))),INDEX(Aggs,MATCH(TRUE,(AgMID=$B37),0),9),INDEX(Aggs,MATCH(1,(AgMID=$B37)*(AgPlant=$F$2),0),9)),\"\")","v":0},{"$f":"IFERROR(IF(OR(ISNA(MATCH(TRUE,(AgPlant=$F$2),0)),ISNA(MATCH(1,(AgMID=$B37)*(AgPlant=$F$2),0))),INDEX(Aggs,MATCH(TRUE,(AgMID=$B37),0),10),INDEX(Aggs,MATCH(1,(AgMID=$B37)*(AgPlant=$F$2),0),10)),\"\")","v":0},{"$f":"IFERROR(IF(OR(ISNA(MATCH(TRUE,(AgPlant=$F$2),0)),ISNA(MATCH(1,(AgMID=$B37)*(AgPlant=$F$2),0))),INDEX(Aggs,MATCH(TRUE,(AgMID=$B37),0),11),INDEX(Aggs,MATCH(1,(AgMID=$B37)*(AgPlant=$F$2),0),11)),\"\")","v":0},{"$f":"IFERROR(IF(OR(ISNA(MATCH(TRUE,(AgPlant=$F$2),0)),ISNA(MATCH(1,(AgMID=$B37)*(AgPlant=$F$2),0))),INDEX(Aggs,MATCH(TRUE,(AgMID=$B37),0),12),INDEX(Aggs,MATCH(1,(AgMID=$B37)*(AgPlant=$F$2),0),12)),\"\")","v":0},{"$f":"IFERROR(IF(OR(ISNA(MATCH(TRUE,(AgPlant=$F$2),0)),ISNA(MATCH(1,(AgMID=$B37)*(AgPlant=$F$2),0))),INDEX(Aggs,MATCH(TRUE,(AgMID=$B37),0),13),INDEX(Aggs,MATCH(1,(AgMID=$B37)*(AgPlant=$F$2),0),13)),\"\")","v":0},{"$f":"IFERROR(IF(OR(ISNA(MATCH(TRUE,(AgPlant=$F$2),0)),ISNA(MATCH(1,(AgMID=$B37)*(AgPlant=$F$2),0))),INDEX(Aggs,MATCH(TRUE,(AgMID=$B37),0),14),INDEX(Aggs,MATCH(1,(AgMID=$B37)*(AgPlant=$F$2),0),14)),\"\")","v":0},{"$f":"IFERROR(IF(OR(ISNA(MATCH(TRUE,(AgPlant=$F$2),0)),ISNA(MATCH(1,(AgMID=$B37)*(AgPlant=$F$2),0))),INDEX(Aggs,MATCH(TRUE,(AgMID=$B37),0),15),INDEX(Aggs,MATCH(1,(AgMID=$B37)*(AgPlant=$F$2),0),15)),\"\")","v":0},{"$f":"IFERROR(IF(OR(ISNA(MATCH(TRUE,(AgPlant=$F$2),0)),ISNA(MATCH(1,(AgMID=$B37)*(AgPlant=$F$2),0))),INDEX(Aggs,MATCH(TRUE,(AgMID=$B37),0),16),INDEX(Aggs,MATCH(1,(AgMID=$B37)*(AgPlant=$F$2),0),16)),\"\")","v":0},{"$f":"IFERROR(IF(OR(ISNA(MATCH(TRUE,(AgPlant=$F$2),0)),ISNA(MATCH(1,(AgMID=$B37)*(AgPlant=$F$2),0))),INDEX(Aggs,MATCH(TRUE,(AgMID=$B37),0),17),INDEX(Aggs,MATCH(1,(AgMID=$B37)*(AgPlant=$F$2),0),17)),\"\")","v":0},{"$f":"IFERROR(IF(OR(ISNA(MATCH(TRUE,(AgPlant=$F$2),0)),ISNA(MATCH(1,(AgMID=$B37)*(AgPlant=$F$2),0))),INDEX(Aggs,MATCH(TRUE,(AgMID=$B37),0),18),INDEX(Aggs,MATCH(1,(AgMID=$B37)*(AgPlant=$F$2),0),18)),\"\")","v":0},{"$f":"IFERROR(IF(OR(ISNA(MATCH(TRUE,(AgPlant=$F$2),0)),ISNA(MATCH(1,(AgMID=$B37)*(AgPlant=$F$2),0))),INDEX(Aggs,MATCH(TRUE,(AgMID=$B37),0),19),INDEX(Aggs,MATCH(1,(AgMID=$B37)*(AgPlant=$F$2),0),19)),\"\")","v":0},{"$f":"IFERROR(IF(OR(ISNA(MATCH(TRUE,(AgPlant=$F$2),0)),ISNA(MATCH(1,(AgMID=$B37)*(AgPlant=$F$2),0))),INDEX(Aggs,MATCH(TRUE,(AgMID=$B37),0),20),INDEX(Aggs,MATCH(1,(AgMID=$B37)*(AgPlant=$F$2),0),20)),\"\")","v":0},{"$f":"IFERROR(IF(OR(ISNA(MATCH(TRUE,(AgPlant=$F$2),0)),ISNA(MATCH(1,(AgMID=$B37)*(AgPlant=$F$2),0))),INDEX(Aggs,MATCH(TRUE,(AgMID=$B37),0),21),INDEX(Aggs,MATCH(1,(AgMID=$B37)*(AgPlant=$F$2),0),21)),\"\")","v":0},{"$f":"IFERROR(IF(OR(ISNA(MATCH(TRUE,(AgPlant=$F$2),0)),ISNA(MATCH(1,(AgMID=$B37)*(AgPlant=$F$2),0))),INDEX(Aggs,MATCH(TRUE,(AgMID=$B37),0),22),INDEX(Aggs,MATCH(1,(AgMID=$B37)*(AgPlant=$F$2),0),22)),\"\")","v":0},{"$f":"IFERROR(IF(OR(ISNA(MATCH(TRUE,(AgPlant=$F$2),0)),ISNA(MATCH(1,(AgMID=$B37)*(AgPlant=$F$2),0))),INDEX(Aggs,MATCH(TRUE,(AgMID=$B37),0),23),INDEX(Aggs,MATCH(1,(AgMID=$B37)*(AgPlant=$F$2),0),23)),\"\")","v":0},{"$f":"IFERROR(IF(OR(ISNA(MATCH(TRUE,(AgPlant=$F$2),0)),ISNA(MATCH(1,(AgMID=$B37)*(AgPlant=$F$2),0))),INDEX(Aggs,MATCH(TRUE,(AgMID=$B37),0),24),INDEX(Aggs,MATCH(1,(AgMID=$B37)*(AgPlant=$F$2),0),24)),\"\")","v":0}]
[null,null,{"$f":"IFERROR(IF(OR(ISNA(MATCH(TRUE,(AgPlant=$F$2),0)),ISNA(MATCH(1,(AgMID=$B38)*(AgPlant=$F$2),0))),INDEX(Aggs,MATCH(TRUE,(AgMID=$B38),0),3),INDEX(Aggs,MATCH(1,(AgMID=$B38)*(AgPlant=$F$2),0),3)),\"\")","v":0},{"$f":"IFERROR(IF(OR(ISNA(MATCH(TRUE,(AgPlant=$F$2),0)),ISNA(MATCH(1,(AgMID=$B38)*(AgPlant=$F$2),0))),INDEX(Aggs,MATCH(TRUE,(AgMID=$B38),0),4),INDEX(Aggs,MATCH(1,(AgMID=$B38)*(AgPlant=$F$2),0),4)),\"\")","v":0},{"$f":"IFERROR(IF(OR(ISNA(MATCH(TRUE,(AgPlant=$F$2),0)),ISNA(MATCH(1,(AgMID=$B38)*(AgPlant=$F$2),0))),INDEX(Aggs,MATCH(TRUE,(AgMID=$B38),0),5),INDEX(Aggs,MATCH(1,(AgMID=$B38)*(AgPlant=$F$2),0),5)),\"\")","v":0},{"$f":"IFERROR(IF(OR(ISNA(MATCH(TRUE,(AgPlant=$F$2),0)),ISNA(MATCH(1,(AgMID=$B38)*(AgPlant=$F$2),0))),INDEX(Aggs,MATCH(TRUE,(AgMID=$B38),0),6),INDEX(Aggs,MATCH(1,(AgMID=$B38)*(AgPlant=$F$2),0),6)),\"\")","v":0},{"$f":"IFERROR(IF(OR(ISNA(MATCH(TRUE,(AgPlant=$F$2),0)),ISNA(MATCH(1,(AgMID=$B38)*(AgPlant=$F$2),0))),INDEX(Aggs,MATCH(TRUE,(AgMID=$B38),0),7),INDEX(Aggs,MATCH(1,(AgMID=$B38)*(AgPlant=$F$2),0),7)),\"\")","v":0},{"$f":"IFERROR(IF(OR(ISNA(MATCH(TRUE,(AgPlant=$F$2),0)),ISNA(MATCH(1,(AgMID=$B38)*(AgPlant=$F$2),0))),INDEX(Aggs,MATCH(TRUE,(AgMID=$B38),0),8),INDEX(Aggs,MATCH(1,(AgMID=$B38)*(AgPlant=$F$2),0),8)),\"\")","v":0},{"$f":"IFERROR(IF(OR(ISNA(MATCH(TRUE,(AgPlant=$F$2),0)),ISNA(MATCH(1,(AgMID=$B38)*(AgPlant=$F$2),0))),INDEX(Aggs,MATCH(TRUE,(AgMID=$B38),0),9),INDEX(Aggs,MATCH(1,(AgMID=$B38)*(AgPlant=$F$2),0),9)),\"\")","v":0},{"$f":"IFERROR(IF(OR(ISNA(MATCH(TRUE,(AgPlant=$F$2),0)),ISNA(MATCH(1,(AgMID=$B38)*(AgPlant=$F$2),0))),INDEX(Aggs,MATCH(TRUE,(AgMID=$B38),0),10),INDEX(Aggs,MATCH(1,(AgMID=$B38)*(AgPlant=$F$2),0),10)),\"\")","v":0},{"$f":"IFERROR(IF(OR(ISNA(MATCH(TRUE,(AgPlant=$F$2),0)),ISNA(MATCH(1,(AgMID=$B38)*(AgPlant=$F$2),0))),INDEX(Aggs,MATCH(TRUE,(AgMID=$B38),0),11),INDEX(Aggs,MATCH(1,(AgMID=$B38)*(AgPlant=$F$2),0),11)),\"\")","v":0},{"$f":"IFERROR(IF(OR(ISNA(MATCH(TRUE,(AgPlant=$F$2),0)),ISNA(MATCH(1,(AgMID=$B38)*(AgPlant=$F$2),0))),INDEX(Aggs,MATCH(TRUE,(AgMID=$B38),0),12),INDEX(Aggs,MATCH(1,(AgMID=$B38)*(AgPlant=$F$2),0),12)),\"\")","v":0},{"$f":"IFERROR(IF(OR(ISNA(MATCH(TRUE,(AgPlant=$F$2),0)),ISNA(MATCH(1,(AgMID=$B38)*(AgPlant=$F$2),0))),INDEX(Aggs,MATCH(TRUE,(AgMID=$B38),0),13),INDEX(Aggs,MATCH(1,(AgMID=$B38)*(AgPlant=$F$2),0),13)),\"\")","v":0},{"$f":"IFERROR(IF(OR(ISNA(MATCH(TRUE,(AgPlant=$F$2),0)),ISNA(MATCH(1,(AgMID=$B38)*(AgPlant=$F$2),0))),INDEX(Aggs,MATCH(TRUE,(AgMID=$B38),0),14),INDEX(Aggs,MATCH(1,(AgMID=$B38)*(AgPlant=$F$2),0),14)),\"\")","v":0},{"$f":"IFERROR(IF(OR(ISNA(MATCH(TRUE,(AgPlant=$F$2),0)),ISNA(MATCH(1,(AgMID=$B38)*(AgPlant=$F$2),0))),INDEX(Aggs,MATCH(TRUE,(AgMID=$B38),0),15),INDEX(Aggs,MATCH(1,(AgMID=$B38)*(AgPlant=$F$2),0),15)),\"\")","v":0},{"$f":"IFERROR(IF(OR(ISNA(MATCH(TRUE,(AgPlant=$F$2),0)),ISNA(MATCH(1,(AgMID=$B38)*(AgPlant=$F$2),0))),INDEX(Aggs,MATCH(TRUE,(AgMID=$B38),0),16),INDEX(Aggs,MATCH(1,(AgMID=$B38)*(AgPlant=$F$2),0),16)),\"\")","v":0},{"$f":"IFERROR(IF(OR(ISNA(MATCH(TRUE,(AgPlant=$F$2),0)),ISNA(MATCH(1,(AgMID=$B38)*(AgPlant=$F$2),0))),INDEX(Aggs,MATCH(TRUE,(AgMID=$B38),0),17),INDEX(Aggs,MATCH(1,(AgMID=$B38)*(AgPlant=$F$2),0),17)),\"\")","v":0},{"$f":"IFERROR(IF(OR(ISNA(MATCH(TRUE,(AgPlant=$F$2),0)),ISNA(MATCH(1,(AgMID=$B38)*(AgPlant=$F$2),0))),INDEX(Aggs,MATCH(TRUE,(AgMID=$B38),0),18),INDEX(Aggs,MATCH(1,(AgMID=$B38)*(AgPlant=$F$2),0),18)),\"\")","v":0},{"$f":"IFERROR(IF(OR(ISNA(MATCH(TRUE,(AgPlant=$F$2),0)),ISNA(MATCH(1,(AgMID=$B38)*(AgPlant=$F$2),0))),INDEX(Aggs,MATCH(TRUE,(AgMID=$B38),0),19),INDEX(Aggs,MATCH(1,(AgMID=$B38)*(AgPlant=$F$2),0),19)),\"\")","v":0},{"$f":"IFERROR(IF(OR(ISNA(MATCH(TRUE,(AgPlant=$F$2),0)),ISNA(MATCH(1,(AgMID=$B38)*(AgPlant=$F$2),0))),INDEX(Aggs,MATCH(TRUE,(AgMID=$B38),0),20),INDEX(Aggs,MATCH(1,(AgMID=$B38)*(AgPlant=$F$2),0),20)),\"\")","v":0},{"$f":"IFERROR(IF(OR(ISNA(MATCH(TRUE,(AgPlant=$F$2),0)),ISNA(MATCH(1,(AgMID=$B38)*(AgPlant=$F$2),0))),INDEX(Aggs,MATCH(TRUE,(AgMID=$B38),0),21),INDEX(Aggs,MATCH(1,(AgMID=$B38)*(AgPlant=$F$2),0),21)),\"\")","v":0},{"$f":"IFERROR(IF(OR(ISNA(MATCH(TRUE,(AgPlant=$F$2),0)),ISNA(MATCH(1,(AgMID=$B38)*(AgPlant=$F$2),0))),INDEX(Aggs,MATCH(TRUE,(AgMID=$B38),0),22),INDEX(Aggs,MATCH(1,(AgMID=$B38)*(AgPlant=$F$2),0),22)),\"\")","v":0},{"$f":"IFERROR(IF(OR(ISNA(MATCH(TRUE,(AgPlant=$F$2),0)),ISNA(MATCH(1,(AgMID=$B38)*(AgPlant=$F$2),0))),INDEX(Aggs,MATCH(TRUE,(AgMID=$B38),0),23),INDEX(Aggs,MATCH(1,(AgMID=$B38)*(AgPlant=$F$2),0),23)),\"\")","v":0},{"$f":"IFERROR(IF(OR(ISNA(MATCH(TRUE,(AgPlant=$F$2),0)),ISNA(MATCH(1,(AgMID=$B38)*(AgPlant=$F$2),0))),INDEX(Aggs,MATCH(TRUE,(AgMID=$B38),0),24),INDEX(Aggs,MATCH(1,(AgMID=$B38)*(AgPlant=$F$2),0),24)),\"\")","v":0}]
[null,null,{"$f":"IFERROR(IF(OR(ISNA(MATCH(TRUE,(AgPlant=$F$2),0)),ISNA(MATCH(1,(AgMID=$B39)*(AgPlant=$F$2),0))),INDEX(Aggs,MATCH(TRUE,(AgMID=$B39),0),3),INDEX(Aggs,MATCH(1,(AgMID=$B39)*(AgPlant=$F$2),0),3)),\"\")","v":0},{"$f":"IFERROR(IF(OR(ISNA(MATCH(TRUE,(AgPlant=$F$2),0)),ISNA(MATCH(1,(AgMID=$B39)*(AgPlant=$F$2),0))),INDEX(Aggs,MATCH(TRUE,(AgMID=$B39),0),4),INDEX(Aggs,MATCH(1,(AgMID=$B39)*(AgPlant=$F$2),0),4)),\"\")","v":0},{"$f":"IFERROR(IF(OR(ISNA(MATCH(TRUE,(AgPlant=$F$2),0)),ISNA(MATCH(1,(AgMID=$B39)*(AgPlant=$F$2),0))),INDEX(Aggs,MATCH(TRUE,(AgMID=$B39),0),5),INDEX(Aggs,MATCH(1,(AgMID=$B39)*(AgPlant=$F$2),0),5)),\"\")","v":0},{"$f":"IFERROR(IF(OR(ISNA(MATCH(TRUE,(AgPlant=$F$2),0)),ISNA(MATCH(1,(AgMID=$B39)*(AgPlant=$F$2),0))),INDEX(Aggs,MATCH(TRUE,(AgMID=$B39),0),6),INDEX(Aggs,MATCH(1,(AgMID=$B39)*(AgPlant=$F$2),0),6)),\"\")","v":0},{"$f":"IFERROR(IF(OR(ISNA(MATCH(TRUE,(AgPlant=$F$2),0)),ISNA(MATCH(1,(AgMID=$B39)*(AgPlant=$F$2),0))),INDEX(Aggs,MATCH(TRUE,(AgMID=$B39),0),7),INDEX(Aggs,MATCH(1,(AgMID=$B39)*(AgPlant=$F$2),0),7)),\"\")","v":0},{"$f":"IFERROR(IF(OR(ISNA(MATCH(TRUE,(AgPlant=$F$2),0)),ISNA(MATCH(1,(AgMID=$B39)*(AgPlant=$F$2),0))),INDEX(Aggs,MATCH(TRUE,(AgMID=$B39),0),8),INDEX(Aggs,MATCH(1,(AgMID=$B39)*(AgPlant=$F$2),0),8)),\"\")","v":0},{"$f":"IFERROR(IF(OR(ISNA(MATCH(TRUE,(AgPlant=$F$2),0)),ISNA(MATCH(1,(AgMID=$B39)*(AgPlant=$F$2),0))),INDEX(Aggs,MATCH(TRUE,(AgMID=$B39),0),9),INDEX(Aggs,MATCH(1,(AgMID=$B39)*(AgPlant=$F$2),0),9)),\"\")","v":0},{"$f":"IFERROR(IF(OR(ISNA(MATCH(TRUE,(AgPlant=$F$2),0)),ISNA(MATCH(1,(AgMID=$B39)*(AgPlant=$F$2),0))),INDEX(Aggs,MATCH(TRUE,(AgMID=$B39),0),10),INDEX(Aggs,MATCH(1,(AgMID=$B39)*(AgPlant=$F$2),0),10)),\"\")","v":0},{"$f":"IFERROR(IF(OR(ISNA(MATCH(TRUE,(AgPlant=$F$2),0)),ISNA(MATCH(1,(AgMID=$B39)*(AgPlant=$F$2),0))),INDEX(Aggs,MATCH(TRUE,(AgMID=$B39),0),11),INDEX(Aggs,MATCH(1,(AgMID=$B39)*(AgPlant=$F$2),0),11)),\"\")","v":0},{"$f":"IFERROR(IF(OR(ISNA(MATCH(TRUE,(AgPlant=$F$2),0)),ISNA(MATCH(1,(AgMID=$B39)*(AgPlant=$F$2),0))),INDEX(Aggs,MATCH(TRUE,(AgMID=$B39),0),12),INDEX(Aggs,MATCH(1,(AgMID=$B39)*(AgPlant=$F$2),0),12)),\"\")","v":0},{"$f":"IFERROR(IF(OR(ISNA(MATCH(TRUE,(AgPlant=$F$2),0)),ISNA(MATCH(1,(AgMID=$B39)*(AgPlant=$F$2),0))),INDEX(Aggs,MATCH(TRUE,(AgMID=$B39),0),13),INDEX(Aggs,MATCH(1,(AgMID=$B39)*(AgPlant=$F$2),0),13)),\"\")","v":0},{"$f":"IFERROR(IF(OR(ISNA(MATCH(TRUE,(AgPlant=$F$2),0)),ISNA(MATCH(1,(AgMID=$B39)*(AgPlant=$F$2),0))),INDEX(Aggs,MATCH(TRUE,(AgMID=$B39),0),14),INDEX(Aggs,MATCH(1,(AgMID=$B39)*(AgPlant=$F$2),0),14)),\"\")","v":0},{"$f":"IFERROR(IF(OR(ISNA(MATCH(TRUE,(AgPlant=$F$2),0)),ISNA(MATCH(1,(AgMID=$B39)*(AgPlant=$F$2),0))),INDEX(Aggs,MATCH(TRUE,(AgMID=$B39),0),15),INDEX(Aggs,MATCH(1,(AgMID=$B39)*(AgPlant=$F$2),0),15)),\"\")","v":0},{"$f":"IFERROR(IF(OR(ISNA(MATCH(TRUE,(AgPlant=$F$2),0)),ISNA(MATCH(1,(AgMID=$B39)*(AgPlant=$F$2),0))),INDEX(Aggs,MATCH(TRUE,(AgMID=$B39),0),16),INDEX(Aggs,MATCH(1,(AgMID=$B39)*(AgPlant=$F$2),0),16)),\"\")","v":0},{"$f":"IFERROR(IF(OR(ISNA(MATCH(TRUE,(AgPlant=$F$2),0)),ISNA(MATCH(1,(AgMID=$B39)*(AgPlant=$F$2),0))),INDEX(Aggs,MATCH(TRUE,(AgMID=$B39),0),17),INDEX(Aggs,MATCH(1,(AgMID=$B39)*(AgPlant=$F$2),0),17)),\"\")","v":0},{"$f":"IFERROR(IF(OR(ISNA(MATCH(TRUE,(AgPlant=$F$2),0)),ISNA(MATCH(1,(AgMID=$B39)*(AgPlant=$F$2),0))),INDEX(Aggs,MATCH(TRUE,(AgMID=$B39),0),18),INDEX(Aggs,MATCH(1,(AgMID=$B39)*(AgPlant=$F$2),0),18)),\"\")","v":0},{"$f":"IFERROR(IF(OR(ISNA(MATCH(TRUE,(AgPlant=$F$2),0)),ISNA(MATCH(1,(AgMID=$B39)*(AgPlant=$F$2),0))),INDEX(Aggs,MATCH(TRUE,(AgMID=$B39),0),19),INDEX(Aggs,MATCH(1,(AgMID=$B39)*(AgPlant=$F$2),0),19)),\"\")","v":0},{"$f":"IFERROR(IF(OR(ISNA(MATCH(TRUE,(AgPlant=$F$2),0)),ISNA(MATCH(1,(AgMID=$B39)*(AgPlant=$F$2),0))),INDEX(Aggs,MATCH(TRUE,(AgMID=$B39),0),20),INDEX(Aggs,MATCH(1,(AgMID=$B39)*(AgPlant=$F$2),0),20)),\"\")","v":0},{"$f":"IFERROR(IF(OR(ISNA(MATCH(TRUE,(AgPlant=$F$2),0)),ISNA(MATCH(1,(AgMID=$B39)*(AgPlant=$F$2),0))),INDEX(Aggs,MATCH(TRUE,(AgMID=$B39),0),21),INDEX(Aggs,MATCH(1,(AgMID=$B39)*(AgPlant=$F$2),0),21)),\"\")","v":0},{"$f":"IFERROR(IF(OR(ISNA(MATCH(TRUE,(AgPlant=$F$2),0)),ISNA(MATCH(1,(AgMID=$B39)*(AgPlant=$F$2),0))),INDEX(Aggs,MATCH(TRUE,(AgMID=$B39),0),22),INDEX(Aggs,MATCH(1,(AgMID=$B39)*(AgPlant=$F$2),0),22)),\"\")","v":0},{"$f":"IFERROR(IF(OR(ISNA(MATCH(TRUE,(AgPlant=$F$2),0)),ISNA(MATCH(1,(AgMID=$B39)*(AgPlant=$F$2),0))),INDEX(Aggs,MATCH(TRUE,(AgMID=$B39),0),23),INDEX(Aggs,MATCH(1,(AgMID=$B39)*(AgPlant=$F$2),0),23)),\"\")","v":0},{"$f":"IFERROR(IF(OR(ISNA(MATCH(TRUE,(AgPlant=$F$2),0)),ISNA(MATCH(1,(AgMID=$B39)*(AgPlant=$F$2),0))),INDEX(Aggs,MATCH(TRUE,(AgMID=$B39),0),24),INDEX(Aggs,MATCH(1,(AgMID=$B39)*(AgPlant=$F$2),0),24)),\"\")","v":0}]
[null,"RECYCLED ASPHALT MATERIAL",null,null,null,null,null,null,null,null,null,"2\"","1 1/2\"","1\"","3/4\"","1/2\"","3/8\"","#4","#8","#16","#30","#50","#100","#200"]
[null,"Material ID ↓","Source","Location","Type","% AC",null,null,null,"% Non-Polish","Non-Polish",50,37.5,25,19,12.5,9.5,4.75,2.36,1.18,0.6,0.3,0.15,7.4999999999999997E-2]
[null,null,{"$f":"IFERROR(IF(OR(ISNA(MATCH(TRUE,(AgPlant=$F$2),0)),ISNA(MATCH(1,(AgMID=$B42)*(AgPlant=$F$2),0))),INDEX(Aggs,MATCH(TRUE,(AgMID=$B42),0),3),INDEX(Aggs,MATCH(1,(AgMID=$B42)*(AgPlant=$F$2),0),3)),\"\")","v":0},{"$f":"IFERROR(IF(OR(ISNA(MATCH(TRUE,(AgPlant=$F$2),0)),ISNA(MATCH(1,(AgMID=$B42)*(AgPlant=$F$2),0))),INDEX(Aggs,MATCH(TRUE,(AgMID=$B42),0),4),INDEX(Aggs,MATCH(1,(AgMID=$B42)*(AgPlant=$F$2),0),4)),\"\")","v":0},{"$f":"IFERROR(IF(OR(ISNA(MATCH(TRUE,(AgPlant=$F$2),0)),ISNA(MATCH(1,(AgMID=$B42)*(AgPlant=$F$2),0))),INDEX(Aggs,MATCH(TRUE,(AgMID=$B42),0),5),INDEX(Aggs,MATCH(1,(AgMID=$B42)*(AgPlant=$F$2),0),5)),\"\")","v":0},{"$f":"IFERROR(IF(OR(ISNA(MATCH(TRUE,(AgPlant=$F$2),0)),ISNA(MATCH(1,(AgMID=$B42)*(AgPlant=$F$2),0))),INDEX(Aggs,MATCH(TRUE,(AgMID=$B42),0),28),INDEX(Aggs,MATCH(1,(AgMID=$B42)*(AgPlant=$F$2),0),28)),\"\")","v":0},null,null,null,{"$f":"IFERROR(IF(OR(ISNA(MATCH(TRUE,(AgPlant=$F$2),0)),ISNA(MATCH(1,(AgMID=$B42)*(AgPlant=$F$2),0))),INDEX(Aggs,MATCH(TRUE,(AgMID=$B42),0),10),INDEX(Aggs,MATCH(1,(AgMID=$B42)*(AgPlant=$F$2),0),10)),\"\")","v":0},{"$f":"IFERROR(IF(OR(ISNA(MATCH(TRUE,(AgPlant=$F$2),0)),ISNA(MATCH(1,(AgMID=$B42)*(AgPlant=$F$2),0))),INDEX(Aggs,MATCH(TRUE,(AgMID=$B42),0),11),INDEX(Aggs,MATCH(1,(AgMID=$B42)*(AgPlant=$F$2),0),11)),\"\")","v":0},{"$f":"IFERROR(IF(OR(ISNA(MATCH(TRUE,(AgPlant=$F$2),0)),ISNA(MATCH(1,(AgMID=$B42)*(AgPlant=$F$2),0))),INDEX(Aggs,MATCH(TRUE,(AgMID=$B42),0),12),INDEX(Aggs,MATCH(1,(AgMID=$B42)*(AgPlant=$F$2),0),12)),\"\")","v":0},{"$f":"IFERROR(IF(OR(ISNA(MATCH(TRUE,(AgPlant=$F$2),0)),ISNA(MATCH(1,(AgMID=$B42)*(AgPlant=$F$2),0))),INDEX(Aggs,MATCH(TRUE,(AgMID=$B42),0),13),INDEX(Aggs,MATCH(1,(AgMID=$B42)*(AgPlant=$F$2),0),13)),\"\")","v":0},{"$f":"IFERROR(IF(OR(ISNA(MATCH(TRUE,(AgPlant=$F$2),0)),ISNA(MATCH(1,(AgMID=$B42)*(AgPlant=$F$2),0))),INDEX(Aggs,MATCH(TRUE,(AgMID=$B42),0),14),INDEX(Aggs,MATCH(1,(AgMID=$B42)*(AgPlant=$F$2),0),14)),\"\")","v":0},{"$f":"IFERROR(IF(OR(ISNA(MATCH(TRUE,(AgPlant=$F$2),0)),ISNA(MATCH(1,(AgMID=$B42)*(AgPlant=$F$2),0))),INDEX(Aggs,MATCH(TRUE,(AgMID=$B42),0),15),INDEX(Aggs,MATCH(1,(AgMID=$B42)*(AgPlant=$F$2),0),15)),\"\")","v":0},{"$f":"IFERROR(IF(OR(ISNA(MATCH(TRUE,(AgPlant=$F$2),0)),ISNA(MATCH(1,(AgMID=$B42)*(AgPlant=$F$2),0))),INDEX(Aggs,MATCH(TRUE,(AgMID=$B42),0),16),INDEX(Aggs,MATCH(1,(AgMID=$B42)*(AgPlant=$F$2),0),16)),\"\")","v":0},{"$f":"IFERROR(IF(OR(ISNA(MATCH(TRUE,(AgPlant=$F$2),0)),ISNA(MATCH(1,(AgMID=$B42)*(AgPlant=$F$2),0))),INDEX(Aggs,MATCH(TRUE,(AgMID=$B42),0),17),INDEX(Aggs,MATCH(1,(AgMID=$B42)*(AgPlant=$F$2),0),17)),\"\")","v":0},{"$f":"IFERROR(IF(OR(ISNA(MATCH(TRUE,(AgPlant=$F$2),0)),ISNA(MATCH(1,(AgMID=$B42)*(AgPlant=$F$2),0))),INDEX(Aggs,MATCH(TRUE,(AgMID=$B42),0),18),INDEX(Aggs,MATCH(1,(AgMID=$B42)*(AgPlant=$F$2),0),18)),\"\")","v":0},{"$f":"IFERROR(IF(OR(ISNA(MATCH(TRUE,(AgPlant=$F$2),0)),ISNA(MATCH(1,(AgMID=$B42)*(AgPlant=$F$2),0))),INDEX(Aggs,MATCH(TRUE,(AgMID=$B42),0),19),INDEX(Aggs,MATCH(1,(AgMID=$B42)*(AgPlant=$F$2),0),19)),\"\")","v":0},{"$f":"IFERROR(IF(OR(ISNA(MATCH(TRUE,(AgPlant=$F$2),0)),ISNA(MATCH(1,(AgMID=$B42)*(AgPlant=$F$2),0))),INDEX(Aggs,MATCH(TRUE,(AgMID=$B42),0),20),INDEX(Aggs,MATCH(1,(AgMID=$B42)*(AgPlant=$F$2),0),20)),\"\")","v":0},{"$f":"IFERROR(IF(OR(ISNA(MATCH(TRUE,(AgPlant=$F$2),0)),ISNA(MATCH(1,(AgMID=$B42)*(AgPlant=$F$2),0))),INDEX(Aggs,MATCH(TRUE,(AgMID=$B42),0),21),INDEX(Aggs,MATCH(1,(AgMID=$B42)*(AgPlant=$F$2),0),21)),\"\")","v":0},{"$f":"IFERROR(IF(OR(ISNA(MATCH(TRUE,(AgPlant=$F$2),0)),ISNA(MATCH(1,(AgMID=$B42)*(AgPlant=$F$2),0))),INDEX(Aggs,MATCH(TRUE,(AgMID=$B42),0),22),INDEX(Aggs,MATCH(1,(AgMID=$B42)*(AgPlant=$F$2),0),22)),\"\")","v":0},{"$f":"IFERROR(IF(OR(ISNA(MATCH(TRUE,(AgPlant=$F$2),0)),ISNA(MATCH(1,(AgMID=$B42)*(AgPlant=$F$2),0))),INDEX(Aggs,MATCH(TRUE,(AgMID=$B42),0),23),INDEX(Aggs,MATCH(1,(AgMID=$B42)*(AgPlant=$F$2),0),23)),\"\")","v":0},{"$f":"IFERROR(IF(OR(ISNA(MATCH(TRUE,(AgPlant=$F$2),0)),ISNA(MATCH(1,(AgMID=$B42)*(AgPlant=$F$2),0))),INDEX(Aggs,MATCH(TRUE,(AgMID=$B42),0),24),INDEX(Aggs,MATCH(1,(AgMID=$B42)*(AgPlant=$F$2),0),24)),\"\")","v":0}]
[null,null,{"$f":"IFERROR(IF(OR(ISNA(MATCH(TRUE,(AgPlant=$F$2),0)),ISNA(MATCH(1,(AgMID=$B43)*(AgPlant=$F$2),0))),INDEX(Aggs,MATCH(TRUE,(AgMID=$B43),0),3),INDEX(Aggs,MATCH(1,(AgMID=$B43)*(AgPlant=$F$2),0),3)),\"\")","v":0},{"$f":"IFERROR(IF(OR(ISNA(MATCH(TRUE,(AgPlant=$F$2),0)),ISNA(MATCH(1,(AgMID=$B43)*(AgPlant=$F$2),0))),INDEX(Aggs,MATCH(TRUE,(AgMID=$B43),0),4),INDEX(Aggs,MATCH(1,(AgMID=$B43)*(AgPlant=$F$2),0),4)),\"\")","v":0},{"$f":"IFERROR(IF(OR(ISNA(MATCH(TRUE,(AgPlant=$F$2),0)),ISNA(MATCH(1,(AgMID=$B43)*(AgPlant=$F$2),0))),INDEX(Aggs,MATCH(TRUE,(AgMID=$B43),0),5),INDEX(Aggs,MATCH(1,(AgMID=$B43)*(AgPlant=$F$2),0),5)),\"\")","v":0},{"$f":"IFERROR(IF(OR(ISNA(MATCH(TRUE,(AgPlant=$F$2),0)),ISNA(MATCH(1,(AgMID=$B43)*(AgPlant=$F$2),0))),INDEX(Aggs,MATCH(TRUE,(AgMID=$B43),0),28),INDEX(Aggs,MATCH(1,(AgMID=$B43)*(AgPlant=$F$2),0),28)),\"\")","v":0},null,null,null,{"$f":"IFERROR(IF(OR(ISNA(MATCH(TRUE,(AgPlant=$F$2),0)),ISNA(MATCH(1,(AgMID=$B43)*(AgPlant=$F$2),0))),INDEX(Aggs,MATCH(TRUE,(AgMID=$B43),0),10),INDEX(Aggs,MATCH(1,(AgMID=$B43)*(AgPlant=$F$2),0),10)),\"\")","v":0},{"$f":"IFERROR(IF(OR(ISNA(MATCH(TRUE,(AgPlant=$F$2),0)),ISNA(MATCH(1,(AgMID=$B43)*(AgPlant=$F$2),0))),INDEX(Aggs,MATCH(TRUE,(AgMID=$B43),0),11),INDEX(Aggs,MATCH(1,(AgMID=$B43)*(AgPlant=$F$2),0),11)),\"\")","v":0},{"$f":"IFERROR(IF(OR(ISNA(MATCH(TRUE,(AgPlant=$F$2),0)),ISNA(MATCH(1,(AgMID=$B43)*(AgPlant=$F$2),0))),INDEX(Aggs,MATCH(TRUE,(AgMID=$B43),0),12),INDEX(Aggs,MATCH(1,(AgMID=$B43)*(AgPlant=$F$2),0),12)),\"\")","v":0},{"$f":"IFERROR(IF(OR(ISNA(MATCH(TRUE,(AgPlant=$F$2),0)),ISNA(MATCH(1,(AgMID=$B43)*(AgPlant=$F$2),0))),INDEX(Aggs,MATCH(TRUE,(AgMID=$B43),0),13),INDEX(Aggs,MATCH(1,(AgMID=$B43)*(AgPlant=$F$2),0),13)),\"\")","v":0},{"$f":"IFERROR(IF(OR(ISNA(MATCH(TRUE,(AgPlant=$F$2),0)),ISNA(MATCH(1,(AgMID=$B43)*(AgPlant=$F$2),0))),INDEX(Aggs,MATCH(TRUE,(AgMID=$B43),0),14),INDEX(Aggs,MATCH(1,(AgMID=$B43)*(AgPlant=$F$2),0),14)),\"\")","v":0},{"$f":"IFERROR(IF(OR(ISNA(MATCH(TRUE,(AgPlant=$F$2),0)),ISNA(MATCH(1,(AgMID=$B43)*(AgPlant=$F$2),0))),INDEX(Aggs,MATCH(TRUE,(AgMID=$B43),0),15),INDEX(Aggs,MATCH(1,(AgMID=$B43)*(AgPlant=$F$2),0),15)),\"\")","v":0},{"$f":"IFERROR(IF(OR(ISNA(MATCH(TRUE,(AgPlant=$F$2),0)),ISNA(MATCH(1,(AgMID=$B43)*(AgPlant=$F$2),0))),INDEX(Aggs,MATCH(TRUE,(AgMID=$B43),0),16),INDEX(Aggs,MATCH(1,(AgMID=$B43)*(AgPlant=$F$2),0),16)),\"\")","v":0},{"$f":"IFERROR(IF(OR(ISNA(MATCH(TRUE,(AgPlant=$F$2),0)),ISNA(MATCH(1,(AgMID=$B43)*(AgPlant=$F$2),0))),INDEX(Aggs,MATCH(TRUE,(AgMID=$B43),0),17),INDEX(Aggs,MATCH(1,(AgMID=$B43)*(AgPlant=$F$2),0),17)),\"\")","v":0},{"$f":"IFERROR(IF(OR(ISNA(MATCH(TRUE,(AgPlant=$F$2),0)),ISNA(MATCH(1,(AgMID=$B43)*(AgPlant=$F$2),0))),INDEX(Aggs,MATCH(TRUE,(AgMID=$B43),0),18),INDEX(Aggs,MATCH(1,(AgMID=$B43)*(AgPlant=$F$2),0),18)),\"\")","v":0},{"$f":"IFERROR(IF(OR(ISNA(MATCH(TRUE,(AgPlant=$F$2),0)),ISNA(MATCH(1,(AgMID=$B43)*(AgPlant=$F$2),0))),INDEX(Aggs,MATCH(TRUE,(AgMID=$B43),0),19),INDEX(Aggs,MATCH(1,(AgMID=$B43)*(AgPlant=$F$2),0),19)),\"\")","v":0},{"$f":"IFERROR(IF(OR(ISNA(MATCH(TRUE,(AgPlant=$F$2),0)),ISNA(MATCH(1,(AgMID=$B43)*(AgPlant=$F$2),0))),INDEX(Aggs,MATCH(TRUE,(AgMID=$B43),0),20),INDEX(Aggs,MATCH(1,(AgMID=$B43)*(AgPlant=$F$2),0),20)),\"\")","v":0},{"$f":"IFERROR(IF(OR(ISNA(MATCH(TRUE,(AgPlant=$F$2),0)),ISNA(MATCH(1,(AgMID=$B43)*(AgPlant=$F$2),0))),INDEX(Aggs,MATCH(TRUE,(AgMID=$B43),0),21),INDEX(Aggs,MATCH(1,(AgMID=$B43)*(AgPlant=$F$2),0),21)),\"\")","v":0},{"$f":"IFERROR(IF(OR(ISNA(MATCH(TRUE,(AgPlant=$F$2),0)),ISNA(MATCH(1,(AgMID=$B43)*(AgPlant=$F$2),0))),INDEX(Aggs,MATCH(TRUE,(AgMID=$B43),0),22),INDEX(Aggs,MATCH(1,(AgMID=$B43)*(AgPlant=$F$2),0),22)),\"\")","v":0},{"$f":"IFERROR(IF(OR(ISNA(MATCH(TRUE,(AgPlant=$F$2),0)),ISNA(MATCH(1,(AgMID=$B43)*(AgPlant=$F$2),0))),INDEX(Aggs,MATCH(TRUE,(AgMID=$B43),0),23),INDEX(Aggs,MATCH(1,(AgMID=$B43)*(AgPlant=$F$2),0),23)),\"\")","v":0},{"$f":"IFERROR(IF(OR(ISNA(MATCH(TRUE,(AgPlant=$F$2),0)),ISNA(MATCH(1,(AgMID=$B43)*(AgPlant=$F$2),0))),INDEX(Aggs,MATCH(TRUE,(AgMID=$B43),0),24),INDEX(Aggs,MATCH(1,(AgMID=$B43)*(AgPlant=$F$2),0),24)),\"\")","v":0}]
[null,null,{"$f":"IFERROR(IF(OR(ISNA(MATCH(TRUE,(AgPlant=$F$2),0)),ISNA(MATCH(1,(AgMID=$B44)*(AgPlant=$F$2),0))),INDEX(Aggs,MATCH(TRUE,(AgMID=$B44),0),3),INDEX(Aggs,MATCH(1,(AgMID=$B44)*(AgPlant=$F$2),0),3)),\"\")","v":0},{"$f":"IFERROR(IF(OR(ISNA(MATCH(TRUE,(AgPlant=$F$2),0)),ISNA(MATCH(1,(AgMID=$B44)*(AgPlant=$F$2),0))),INDEX(Aggs,MATCH(TRUE,(AgMID=$B44),0),4),INDEX(Aggs,MATCH(1,(AgMID=$B44)*(AgPlant=$F$2),0),4)),\"\")","v":0},{"$f":"IFERROR(IF(OR(ISNA(MATCH(TRUE,(AgPlant=$F$2),0)),ISNA(MATCH(1,(AgMID=$B44)*(AgPlant=$F$2),0))),INDEX(Aggs,MATCH(TRUE,(AgMID=$B44),0),5),INDEX(Aggs,MATCH(1,(AgMID=$B44)*(AgPlant=$F$2),0),5)),\"\")","v":0},{"$f":"IFERROR(IF(OR(ISNA(MATCH(TRUE,(AgPlant=$F$2),0)),ISNA(MATCH(1,(AgMID=$B44)*(AgPlant=$F$2),0))),INDEX(Aggs,MATCH(TRUE,(AgMID=$B44),0),28),INDEX(Aggs,MATCH(1,(AgMID=$B44)*(AgPlant=$F$2),0),28)),\"\")","v":0},null,null,null,{"$f":"IFERROR(IF(OR(ISNA(MATCH(TRUE,(AgPlant=$F$2),0)),ISNA(MATCH(1,(AgMID=$B44)*(AgPlant=$F$2),0))),INDEX(Aggs,MATCH(TRUE,(AgMID=$B44),0),10),INDEX(Aggs,MATCH(1,(AgMID=$B44)*(AgPlant=$F$2),0),10)),\"\")","v":0},{"$f":"IFERROR(IF(OR(ISNA(MATCH(TRUE,(AgPlant=$F$2),0)),ISNA(MATCH(1,(AgMID=$B44)*(AgPlant=$F$2),0))),INDEX(Aggs,MATCH(TRUE,(AgMID=$B44),0),11),INDEX(Aggs,MATCH(1,(AgMID=$B44)*(AgPlant=$F$2),0),11)),\"\")","v":0},{"$f":"IFERROR(IF(OR(ISNA(MATCH(TRUE,(AgPlant=$F$2),0)),ISNA(MATCH(1,(AgMID=$B44)*(AgPlant=$F$2),0))),INDEX(Aggs,MATCH(TRUE,(AgMID=$B44),0),12),INDEX(Aggs,MATCH(1,(AgMID=$B44)*(AgPlant=$F$2),0),12)),\"\")","v":0},{"$f":"IFERROR(IF(OR(ISNA(MATCH(TRUE,(AgPlant=$F$2),0)),ISNA(MATCH(1,(AgMID=$B44)*(AgPlant=$F$2),0))),INDEX(Aggs,MATCH(TRUE,(AgMID=$B44),0),13),INDEX(Aggs,MATCH(1,(AgMID=$B44)*(AgPlant=$F$2),0),13)),\"\")","v":0},{"$f":"IFERROR(IF(OR(ISNA(MATCH(TRUE,(AgPlant=$F$2),0)),ISNA(MATCH(1,(AgMID=$B44)*(AgPlant=$F$2),0))),INDEX(Aggs,MATCH(TRUE,(AgMID=$B44),0),14),INDEX(Aggs,MATCH(1,(AgMID=$B44)*(AgPlant=$F$2),0),14)),\"\")","v":0},{"$f":"IFERROR(IF(OR(ISNA(MATCH(TRUE,(AgPlant=$F$2),0)),ISNA(MATCH(1,(AgMID=$B44)*(AgPlant=$F$2),0))),INDEX(Aggs,MATCH(TRUE,(AgMID=$B44),0),15),INDEX(Aggs,MATCH(1,(AgMID=$B44)*(AgPlant=$F$2),0),15)),\"\")","v":0},{"$f":"IFERROR(IF(OR(ISNA(MATCH(TRUE,(AgPlant=$F$2),0)),ISNA(MATCH(1,(AgMID=$B44)*(AgPlant=$F$2),0))),INDEX(Aggs,MATCH(TRUE,(AgMID=$B44),0),16),INDEX(Aggs,MATCH(1,(AgMID=$B44)*(AgPlant=$F$2),0),16)),\"\")","v":0},{"$f":"IFERROR(IF(OR(ISNA(MATCH(TRUE,(AgPlant=$F$2),0)),ISNA(MATCH(1,(AgMID=$B44)*(AgPlant=$F$2),0))),INDEX(Aggs,MATCH(TRUE,(AgMID=$B44),0),17),INDEX(Aggs,MATCH(1,(AgMID=$B44)*(AgPlant=$F$2),0),17)),\"\")","v":0},{"$f":"IFERROR(IF(OR(ISNA(MATCH(TRUE,(AgPlant=$F$2),0)),ISNA(MATCH(1,(AgMID=$B44)*(AgPlant=$F$2),0))),INDEX(Aggs,MATCH(TRUE,(AgMID=$B44),0),18),INDEX(Aggs,MATCH(1,(AgMID=$B44)*(AgPlant=$F$2),0),18)),\"\")","v":0},{"$f":"IFERROR(IF(OR(ISNA(MATCH(TRUE,(AgPlant=$F$2),0)),ISNA(MATCH(1,(AgMID=$B44)*(AgPlant=$F$2),0))),INDEX(Aggs,MATCH(TRUE,(AgMID=$B44),0),19),INDEX(Aggs,MATCH(1,(AgMID=$B44)*(AgPlant=$F$2),0),19)),\"\")","v":0},{"$f":"IFERROR(IF(OR(ISNA(MATCH(TRUE,(AgPlant=$F$2),0)),ISNA(MATCH(1,(AgMID=$B44)*(AgPlant=$F$2),0))),INDEX(Aggs,MATCH(TRUE,(AgMID=$B44),0),20),INDEX(Aggs,MATCH(1,(AgMID=$B44)*(AgPlant=$F$2),0),20)),\"\")","v":0},{"$f":"IFERROR(IF(OR(ISNA(MATCH(TRUE,(AgPlant=$F$2),0)),ISNA(MATCH(1,(AgMID=$B44)*(AgPlant=$F$2),0))),INDEX(Aggs,MATCH(TRUE,(AgMID=$B44),0),21),INDEX(Aggs,MATCH(1,(AgMID=$B44)*(AgPlant=$F$2),0),21)),\"\")","v":0},{"$f":"IFERROR(IF(OR(ISNA(MATCH(TRUE,(AgPlant=$F$2),0)),ISNA(MATCH(1,(AgMID=$B44)*(AgPlant=$F$2),0))),INDEX(Aggs,MATCH(TRUE,(AgMID=$B44),0),22),INDEX(Aggs,MATCH(1,(AgMID=$B44)*(AgPlant=$F$2),0),22)),\"\")","v":0},{"$f":"IFERROR(IF(OR(ISNA(MATCH(TRUE,(AgPlant=$F$2),0)),ISNA(MATCH(1,(AgMID=$B44)*(AgPlant=$F$2),0))),INDEX(Aggs,MATCH(TRUE,(AgMID=$B44),0),23),INDEX(Aggs,MATCH(1,(AgMID=$B44)*(AgPlant=$F$2),0),23)),\"\")","v":0},{"$f":"IFERROR(IF(OR(ISNA(MATCH(TRUE,(AgPlant=$F$2),0)),ISNA(MATCH(1,(AgMID=$B44)*(AgPlant=$F$2),0))),INDEX(Aggs,MATCH(TRUE,(AgMID=$B44),0),24),INDEX(Aggs,MATCH(1,(AgMID=$B44)*(AgPlant=$F$2),0),24)),\"\")","v":0}]
[null,null,{"$f":"IFERROR(IF(OR(ISNA(MATCH(TRUE,(AgPlant=$F$2),0)),ISNA(MATCH(1,(AgMID=$B45)*(AgPlant=$F$2),0))),INDEX(Aggs,MATCH(TRUE,(AgMID=$B45),0),3),INDEX(Aggs,MATCH(1,(AgMID=$B45)*(AgPlant=$F$2),0),3)),\"\")","v":0},{"$f":"IFERROR(IF(OR(ISNA(MATCH(TRUE,(AgPlant=$F$2),0)),ISNA(MATCH(1,(AgMID=$B45)*(AgPlant=$F$2),0))),INDEX(Aggs,MATCH(TRUE,(AgMID=$B45),0),4),INDEX(Aggs,MATCH(1,(AgMID=$B45)*(AgPlant=$F$2),0),4)),\"\")","v":0},{"$f":"IFERROR(IF(OR(ISNA(MATCH(TRUE,(AgPlant=$F$2),0)),ISNA(MATCH(1,(AgMID=$B45)*(AgPlant=$F$2),0))),INDEX(Aggs,MATCH(TRUE,(AgMID=$B45),0),5),INDEX(Aggs,MATCH(1,(AgMID=$B45)*(AgPlant=$F$2),0),5)),\"\")","v":0},{"$f":"IFERROR(IF(OR(ISNA(MATCH(TRUE,(AgPlant=$F$2),0)),ISNA(MATCH(1,(AgMID=$B45)*(AgPlant=$F$2),0))),INDEX(Aggs,MATCH(TRUE,(AgMID=$B45),0),28),INDEX(Aggs,MATCH(1,(AgMID=$B45)*(AgPlant=$F$2),0),28)),\"\")","v":0},null,null,null,{"$f":"IFERROR(IF(OR(ISNA(MATCH(TRUE,(AgPlant=$F$2),0)),ISNA(MATCH(1,(AgMID=$B45)*(AgPlant=$F$2),0))),INDEX(Aggs,MATCH(TRUE,(AgMID=$B45),0),10),INDEX(Aggs,MATCH(1,(AgMID=$B45)*(AgPlant=$F$2),0),10)),\"\")","v":0},{"$f":"IFERROR(IF(OR(ISNA(MATCH(TRUE,(AgPlant=$F$2),0)),ISNA(MATCH(1,(AgMID=$B45)*(AgPlant=$F$2),0))),INDEX(Aggs,MATCH(TRUE,(AgMID=$B45),0),11),INDEX(Aggs,MATCH(1,(AgMID=$B45)*(AgPlant=$F$2),0),11)),\"\")","v":0},{"$f":"IFERROR(IF(OR(ISNA(MATCH(TRUE,(AgPlant=$F$2),0)),ISNA(MATCH(1,(AgMID=$B45)*(AgPlant=$F$2),0))),INDEX(Aggs,MATCH(TRUE,(AgMID=$B45),0),12),INDEX(Aggs,MATCH(1,(AgMID=$B45)*(AgPlant=$F$2),0),12)),\"\")","v":0},{"$f":"IFERROR(IF(OR(ISNA(MATCH(TRUE,(AgPlant=$F$2),0)),ISNA(MATCH(1,(AgMID=$B45)*(AgPlant=$F$2),0))),INDEX(Aggs,MATCH(TRUE,(AgMID=$B45),0),13),INDEX(Aggs,MATCH(1,(AgMID=$B45)*(AgPlant=$F$2),0),13)),\"\")","v":0},{"$f":"IFERROR(IF(OR(ISNA(MATCH(TRUE,(AgPlant=$F$2),0)),ISNA(MATCH(1,(AgMID=$B45)*(AgPlant=$F$2),0))),INDEX(Aggs,MATCH(TRUE,(AgMID=$B45),0),14),INDEX(Aggs,MATCH(1,(AgMID=$B45)*(AgPlant=$F$2),0),14)),\"\")","v":0},{"$f":"IFERROR(IF(OR(ISNA(MATCH(TRUE,(AgPlant=$F$2),0)),ISNA(MATCH(1,(AgMID=$B45)*(AgPlant=$F$2),0))),INDEX(Aggs,MATCH(TRUE,(AgMID=$B45),0),15),INDEX(Aggs,MATCH(1,(AgMID=$B45)*(AgPlant=$F$2),0),15)),\"\")","v":0},{"$f":"IFERROR(IF(OR(ISNA(MATCH(TRUE,(AgPlant=$F$2),0)),ISNA(MATCH(1,(AgMID=$B45)*(AgPlant=$F$2),0))),INDEX(Aggs,MATCH(TRUE,(AgMID=$B45),0),16),INDEX(Aggs,MATCH(1,(AgMID=$B45)*(AgPlant=$F$2),0),16)),\"\")","v":0},{"$f":"IFERROR(IF(OR(ISNA(MATCH(TRUE,(AgPlant=$F$2),0)),ISNA(MATCH(1,(AgMID=$B45)*(AgPlant=$F$2),0))),INDEX(Aggs,MATCH(TRUE,(AgMID=$B45),0),17),INDEX(Aggs,MATCH(1,(AgMID=$B45)*(AgPlant=$F$2),0),17)),\"\")","v":0},{"$f":"IFERROR(IF(OR(ISNA(MATCH(TRUE,(AgPlant=$F$2),0)),ISNA(MATCH(1,(AgMID=$B45)*(AgPlant=$F$2),0))),INDEX(Aggs,MATCH(TRUE,(AgMID=$B45),0),18),INDEX(Aggs,MATCH(1,(AgMID=$B45)*(AgPlant=$F$2),0),18)),\"\")","v":0},{"$f":"IFERROR(IF(OR(ISNA(MATCH(TRUE,(AgPlant=$F$2),0)),ISNA(MATCH(1,(AgMID=$B45)*(AgPlant=$F$2),0))),INDEX(Aggs,MATCH(TRUE,(AgMID=$B45),0),19),INDEX(Aggs,MATCH(1,(AgMID=$B45)*(AgPlant=$F$2),0),19)),\"\")","v":0},{"$f":"IFERROR(IF(OR(ISNA(MATCH(TRUE,(AgPlant=$F$2),0)),ISNA(MATCH(1,(AgMID=$B45)*(AgPlant=$F$2),0))),INDEX(Aggs,MATCH(TRUE,(AgMID=$B45),0),20),INDEX(Aggs,MATCH(1,(AgMID=$B45)*(AgPlant=$F$2),0),20)),\"\")","v":0},{"$f":"IFERROR(IF(OR(ISNA(MATCH(TRUE,(AgPlant=$F$2),0)),ISNA(MATCH(1,(AgMID=$B45)*(AgPlant=$F$2),0))),INDEX(Aggs,MATCH(TRUE,(AgMID=$B45),0),21),INDEX(Aggs,MATCH(1,(AgMID=$B45)*(AgPlant=$F$2),0),21)),\"\")","v":0},{"$f":"IFERROR(IF(OR(ISNA(MATCH(TRUE,(AgPlant=$F$2),0)),ISNA(MATCH(1,(AgMID=$B45)*(AgPlant=$F$2),0))),INDEX(Aggs,MATCH(TRUE,(AgMID=$B45),0),22),INDEX(Aggs,MATCH(1,(AgMID=$B45)*(AgPlant=$F$2),0),22)),\"\")","v":0},{"$f":"IFERROR(IF(OR(ISNA(MATCH(TRUE,(AgPlant=$F$2),0)),ISNA(MATCH(1,(AgMID=$B45)*(AgPlant=$F$2),0))),INDEX(Aggs,MATCH(TRUE,(AgMID=$B45),0),23),INDEX(Aggs,MATCH(1,(AgMID=$B45)*(AgPlant=$F$2),0),23)),\"\")","v":0},{"$f":"IFERROR(IF(OR(ISNA(MATCH(TRUE,(AgPlant=$F$2),0)),ISNA(MATCH(1,(AgMID=$B45)*(AgPlant=$F$2),0))),INDEX(Aggs,MATCH(TRUE,(AgMID=$B45),0),24),INDEX(Aggs,MATCH(1,(AgMID=$B45)*(AgPlant=$F$2),0),24)),\"\")","v":0}]
[null,"AGGREGATE ADDITIVES (Hydrated Lime, Mineral Filler & Baghouse)",null,null,null,null,null,null,null,null,null,"2\"","1 1/2\"","1\"","3/4\"","1/2\"","3/8\"","#4","#8","#16","#30","#50","#100","#200"]
[null,"Material ID ↓","Source","Location","Type","Baghouse Fines","Gsb",null,null,null,null,50,37.5,25,19,12.5,9.5,4.75,2.36,1.18,0.6,0.3,0.15,7.4999999999999997E-2]
[null,null,{"$f":"IFERROR(IF(OR(ISNA(MATCH(TRUE,(AdPlant=$F$2),0)),ISNA(MATCH(1,(AdMID=$B48)*(AdPlant=$F$2),0))),INDEX(Addtv,MATCH(TRUE,(AdMID=$B48),0),3),INDEX(Addtv,MATCH(1,(AdMID=$B48)*(AdPlant=$F$2),0),3)),\"\")","v":"INNOPHOS, INC."},{"$f":"IFERROR(IF(OR(ISNA(MATCH(TRUE,(AdPlant=$F$2),0)),ISNA(MATCH(1,(AdMID=$B48)*(AdPlant=$F$2),0))),INDEX(Addtv,MATCH(TRUE,(AdMID=$B48),0),4),INDEX(Addtv,MATCH(1,(AdMID=$B48)*(AdPlant=$F$2),0),4)),\"\")","v":"CRANBURY, NJ"},{"$f":"IFERROR(IF(OR(ISNA(MATCH(TRUE,(AdPlant=$F$2),0)),ISNA(MATCH(1,(AdMID=$B48)*(AdPlant=$F$2),0))),INDEX(Addtv,MATCH(TRUE,(AdMID=$B48),0),6),INDEX(Addtv,MATCH(1,(AdMID=$B48)*(AdPlant=$F$2),0),6)),\"\")","v":"Anti-Strip"},{"$f":"IFERROR(IF(OR(ISNA(MATCH(TRUE,(AdPlant=$F$2),0)),ISNA(MATCH(1,(AdMID=$B48)*(AdPlant=$F$2),0))),INDEX(Addtv,MATCH(TRUE,(AdMID=$B48),0),8),INDEX(Addtv,MATCH(1,(AdMID=$B48)*(AdPlant=$F$2),0),8)),\"\")","v":0},{"$f":"IFERROR(IF(OR(ISNA(MATCH(TRUE,(AdPlant=$F$2),0)),ISNA(MATCH(1,(AdMID=$B48)*(AdPlant=$F$2),0))),INDEX(Addtv,MATCH(TRUE,(AdMID=$B48),0),22),INDEX(Addtv,MATCH(1,(AdMID=$B48)*(AdPlant=$F$2),0),22)),\"\")","v":0},null,null,null,null,{"$f":"IFERROR(IF(OR(ISNA(MATCH(TRUE,(AdPlant=$F$2),0)),ISNA(MATCH(1,(AdMID=$B48)*(AdPlant=$F$2),0))),INDEX(Addtv,MATCH(TRUE,(AdMID=$B48),0),9),INDEX(Addtv,MATCH(1,(AdMID=$B48)*(AdPlant=$F$2),0),9)),\"\")","v":0},{"$f":"IFERROR(IF(OR(ISNA(MATCH(TRUE,(AdPlant=$F$2),0)),ISNA(MATCH(1,(AdMID=$B48)*(AdPlant=$F$2),0))),INDEX(Addtv,MATCH(TRUE,(AdMID=$B48),0),10),INDEX(Addtv,MATCH(1,(AdMID=$B48)*(AdPlant=$F$2),0),10)),\"\")","v":0},{"$f":"IFERROR(IF(OR(ISNA(MATCH(TRUE,(AdPlant=$F$2),0)),ISNA(MATCH(1,(AdMID=$B48)*(AdPlant=$F$2),0))),INDEX(Addtv,MATCH(TRUE,(AdMID=$B48),0),11),INDEX(Addtv,MATCH(1,(AdMID=$B48)*(AdPlant=$F$2),0),11)),\"\")","v":0},{"$f":"IFERROR(IF(OR(ISNA(MATCH(TRUE,(AdPlant=$F$2),0)),ISNA(MATCH(1,(AdMID=$B48)*(AdPlant=$F$2),0))),INDEX(Addtv,MATCH(TRUE,(AdMID=$B48),0),12),INDEX(Addtv,MATCH(1,(AdMID=$B48)*(AdPlant=$F$2),0),12)),\"\")","v":0},{"$f":"IFERROR(IF(OR(ISNA(MATCH(TRUE,(AdPlant=$F$2),0)),ISNA(MATCH(1,(AdMID=$B48)*(AdPlant=$F$2),0))),INDEX(Addtv,MATCH(TRUE,(AdMID=$B48),0),13),INDEX(Addtv,MATCH(1,(AdMID=$B48)*(AdPlant=$F$2),0),13)),\"\")","v":0},{"$f":"IFERROR(IF(OR(ISNA(MATCH(TRUE,(AdPlant=$F$2),0)),ISNA(MATCH(1,(AdMID=$B48)*(AdPlant=$F$2),0))),INDEX(Addtv,MATCH(TRUE,(AdMID=$B48),0),14),INDEX(Addtv,MATCH(1,(AdMID=$B48)*(AdPlant=$F$2),0),14)),\"\")","v":0},{"$f":"IFERROR(IF(OR(ISNA(MATCH(TRUE,(AdPlant=$F$2),0)),ISNA(MATCH(1,(AdMID=$B48)*(AdPlant=$F$2),0))),INDEX(Addtv,MATCH(TRUE,(AdMID=$B48),0),15),INDEX(Addtv,MATCH(1,(AdMID=$B48)*(AdPlant=$F$2),0),15)),\"\")","v":0},{"$f":"IFERROR(IF(OR(ISNA(MATCH(TRUE,(AdPlant=$F$2),0)),ISNA(MATCH(1,(AdMID=$B48)*(AdPlant=$F$2),0))),INDEX(Addtv,MATCH(TRUE,(AdMID=$B48),0),16),INDEX(Addtv,MATCH(1,(AdMID=$B48)*(AdPlant=$F$2),0),16)),\"\")","v":0},{"$f":"IFERROR(IF(OR(ISNA(MATCH(TRUE,(AdPlant=$F$2),0)),ISNA(MATCH(1,(AdMID=$B48)*(AdPlant=$F$2),0))),INDEX(Addtv,MATCH(TRUE,(AdMID=$B48),0),17),INDEX(Addtv,MATCH(1,(AdMID=$B48)*(AdPlant=$F$2),0),17)),\"\")","v":0},{"$f":"IFERROR(IF(OR(ISNA(MATCH(TRUE,(AdPlant=$F$2),0)),ISNA(MATCH(1,(AdMID=$B48)*(AdPlant=$F$2),0))),INDEX(Addtv,MATCH(TRUE,(AdMID=$B48),0),18),INDEX(Addtv,MATCH(1,(AdMID=$B48)*(AdPlant=$F$2),0),18)),\"\")","v":0},{"$f":"IFERROR(IF(OR(ISNA(MATCH(TRUE,(AdPlant=$F$2),0)),ISNA(MATCH(1,(AdMID=$B48)*(AdPlant=$F$2),0))),INDEX(Addtv,MATCH(TRUE,(AdMID=$B48),0),19),INDEX(Addtv,MATCH(1,(AdMID=$B48)*(AdPlant=$F$2),0),19)),\"\")","v":0},{"$f":"IFERROR(IF(OR(ISNA(MATCH(TRUE,(AdPlant=$F$2),0)),ISNA(MATCH(1,(AdMID=$B48)*(AdPlant=$F$2),0))),INDEX(Addtv,MATCH(TRUE,(AdMID=$B48),0),20),INDEX(Addtv,MATCH(1,(AdMID=$B48)*(AdPlant=$F$2),0),20)),\"\")","v":0},{"$f":"IFERROR(IF(OR(ISNA(MATCH(TRUE,(AdPlant=$F$2),0)),ISNA(MATCH(1,(AdMID=$B48)*(AdPlant=$F$2),0))),INDEX(Addtv,MATCH(TRUE,(AdMID=$B48),0),21),INDEX(Addtv,MATCH(1,(AdMID=$B48)*(AdPlant=$F$2),0),21)),\"\")","v":0}]
[null,null,{"$f":"IFERROR(IF(OR(ISNA(MATCH(TRUE,(AdPlant=$F$2),0)),ISNA(MATCH(1,(AdMID=$B49)*(AdPlant=$F$2),0))),INDEX(Addtv,MATCH(TRUE,(AdMID=$B49),0),3),INDEX(Addtv,MATCH(1,(AdMID=$B49)*(AdPlant=$F$2),0),3)),\"\")","v":"INNOPHOS, INC."},{"$f":"IFERROR(IF(OR(ISNA(MATCH(TRUE,(AdPlant=$F$2),0)),ISNA(MATCH(1,(AdMID=$B49)*(AdPlant=$F$2),0))),INDEX(Addtv,MATCH(TRUE,(AdMID=$B49),0),4),INDEX(Addtv,MATCH(1,(AdMID=$B49)*(AdPlant=$F$2),0),4)),\"\")","v":"CRANBURY, NJ"},{"$f":"IFERROR(IF(OR(ISNA(MATCH(TRUE,(AdPlant=$F$2),0)),ISNA(MATCH(1,(AdMID=$B49)*(AdPlant=$F$2),0))),INDEX(Addtv,MATCH(TRUE,(AdMID=$B49),0),6),INDEX(Addtv,MATCH(1,(AdMID=$B49)*(AdPlant=$F$2),0),6)),\"\")","v":"Anti-Strip"},{"$f":"IFERROR(IF(OR(ISNA(MATCH(TRUE,(AdPlant=$F$2),0)),ISNA(MATCH(1,(AdMID=$B49)*(AdPlant=$F$2),0))),INDEX(Addtv,MATCH(TRUE,(AdMID=$B49),0),8),INDEX(Addtv,MATCH(1,(AdMID=$B49)*(AdPlant=$F$2),0),8)),\"\")","v":0},{"$f":"IFERROR(IF(OR(ISNA(MATCH(TRUE,(AdPlant=$F$2),0)),ISNA(MATCH(1,(AdMID=$B49)*(AdPlant=$F$2),0))),INDEX(Addtv,MATCH(TRUE,(AdMID=$B49),0),22),INDEX(Addtv,MATCH(1,(AdMID=$B49)*(AdPlant=$F$2),0),22)),\"\")","v":0},null,null,null,null,{"$f":"IFERROR(IF(OR(ISNA(MATCH(TRUE,(AdPlant=$F$2),0)),ISNA(MATCH(1,(AdMID=$B49)*(AdPlant=$F$2),0))),INDEX(Addtv,MATCH(TRUE,(AdMID=$B49),0),9),INDEX(Addtv,MATCH(1,(AdMID=$B49)*(AdPlant=$F$2),0),9)),\"\")","v":0},{"$f":"IFERROR(IF(OR(ISNA(MATCH(TRUE,(AdPlant=$F$2),0)),ISNA(MATCH(1,(AdMID=$B49)*(AdPlant=$F$2),0))),INDEX(Addtv,MATCH(TRUE,(AdMID=$B49),0),10),INDEX(Addtv,MATCH(1,(AdMID=$B49)*(AdPlant=$F$2),0),10)),\"\")","v":0},{"$f":"IFERROR(IF(OR(ISNA(MATCH(TRUE,(AdPlant=$F$2),0)),ISNA(MATCH(1,(AdMID=$B49)*(AdPlant=$F$2),0))),INDEX(Addtv,MATCH(TRUE,(AdMID=$B49),0),11),INDEX(Addtv,MATCH(1,(AdMID=$B49)*(AdPlant=$F$2),0),11)),\"\")","v":0},{"$f":"IFERROR(IF(OR(ISNA(MATCH(TRUE,(AdPlant=$F$2),0)),ISNA(MATCH(1,(AdMID=$B49)*(AdPlant=$F$2),0))),INDEX(Addtv,MATCH(TRUE,(AdMID=$B49),0),12),INDEX(Addtv,MATCH(1,(AdMID=$B49)*(AdPlant=$F$2),0),12)),\"\")","v":0},{"$f":"IFERROR(IF(OR(ISNA(MATCH(TRUE,(AdPlant=$F$2),0)),ISNA(MATCH(1,(AdMID=$B49)*(AdPlant=$F$2),0))),INDEX(Addtv,MATCH(TRUE,(AdMID=$B49),0),13),INDEX(Addtv,MATCH(1,(AdMID=$B49)*(AdPlant=$F$2),0),13)),\"\")","v":0},{"$f":"IFERROR(IF(OR(ISNA(MATCH(TRUE,(AdPlant=$F$2),0)),ISNA(MATCH(1,(AdMID=$B49)*(AdPlant=$F$2),0))),INDEX(Addtv,MATCH(TRUE,(AdMID=$B49),0),14),INDEX(Addtv,MATCH(1,(AdMID=$B49)*(AdPlant=$F$2),0),14)),\"\")","v":0},{"$f":"IFERROR(IF(OR(ISNA(MATCH(TRUE,(AdPlant=$F$2),0)),ISNA(MATCH(1,(AdMID=$B49)*(AdPlant=$F$2),0))),INDEX(Addtv,MATCH(TRUE,(AdMID=$B49),0),15),INDEX(Addtv,MATCH(1,(AdMID=$B49)*(AdPlant=$F$2),0),15)),\"\")","v":0},{"$f":"IFERROR(IF(OR(ISNA(MATCH(TRUE,(AdPlant=$F$2),0)),ISNA(MATCH(1,(AdMID=$B49)*(AdPlant=$F$2),0))),INDEX(Addtv,MATCH(TRUE,(AdMID=$B49),0),16),INDEX(Addtv,MATCH(1,(AdMID=$B49)*(AdPlant=$F$2),0),16)),\"\")","v":0},{"$f":"IFERROR(IF(OR(ISNA(MATCH(TRUE,(AdPlant=$F$2),0)),ISNA(MATCH(1,(AdMID=$B49)*(AdPlant=$F$2),0))),INDEX(Addtv,MATCH(TRUE,(AdMID=$B49),0),17),INDEX(Addtv,MATCH(1,(AdMID=$B49)*(AdPlant=$F$2),0),17)),\"\")","v":0},{"$f":"IFERROR(IF(OR(ISNA(MATCH(TRUE,(AdPlant=$F$2),0)),ISNA(MATCH(1,(AdMID=$B49)*(AdPlant=$F$2),0))),INDEX(Addtv,MATCH(TRUE,(AdMID=$B49),0),18),INDEX(Addtv,MATCH(1,(AdMID=$B49)*(AdPlant=$F$2),0),18)),\"\")","v":0},{"$f":"IFERROR(IF(OR(ISNA(MATCH(TRUE,(AdPlant=$F$2),0)),ISNA(MATCH(1,(AdMID=$B49)*(AdPlant=$F$2),0))),INDEX(Addtv,MATCH(TRUE,(AdMID=$B49),0),19),INDEX(Addtv,MATCH(1,(AdMID=$B49)*(AdPlant=$F$2),0),19)),\"\")","v":0},{"$f":"IFERROR(IF(OR(ISNA(MATCH(TRUE,(AdPlant=$F$2),0)),ISNA(MATCH(1,(AdMID=$B49)*(AdPlant=$F$2),0))),INDEX(Addtv,MATCH(TRUE,(AdMID=$B49),0),20),INDEX(Addtv,MATCH(1,(AdMID=$B49)*(AdPlant=$F$2),0),20)),\"\")","v":0},{"$f":"IFERROR(IF(OR(ISNA(MATCH(TRUE,(AdPlant=$F$2),0)),ISNA(MATCH(1,(AdMID=$B49)*(AdPlant=$F$2),0))),INDEX(Addtv,MATCH(TRUE,(AdMID=$B49),0),21),INDEX(Addtv,MATCH(1,(AdMID=$B49)*(AdPlant=$F$2),0),21)),\"\")","v":0}]

{"sheet":"Blending","index":5,"n_rows":129,"n_cols":43,"rows_kept":129,"cut":false,"hidden":false,"merged":[[110,0,111,0],[23,0,24,0],[29,0,30,0],[46,0,47,0],[31,0,31,1],[1,1,1,2],[2,1,2,2],[37,0,38,0],[67,0,68,0],[89,0,90,0]]}
["COLD FEED INFO",null,null,null,null,null,null,null,null,null,null,null,null,null,null,null,null,null,null,null,null,null,null,null,null,null,null,null,null,null,null,null,"Missouri DOT Specifications"]
["MAT'L.","AGGREGATE",null,"AGGREGATE","COLD FEED","APPARENT","BULK",null,null,null,null,null,null,null,null,null,null,null,null,null,null,null,null,null,null,null,null,null,{"$f":"Initial_Info1!C7&Initial_Info1!D7","v":""}]
["ID.","SOURCE",null,"GRADING","%","Sp.Gravity","Sp.Gravity",null,null,null,null,null,null,null,null,null,null,null,null,null,null,null,null,null,null,null,null,null,{"$f":"Initial_Info1!C7&IF(LEFT(Initial_Info1!D7,3)=\"BSM\",\"SM\",\"\")","v":""},null,"2\"","1 1/2\"","1\"","3/4\"","1/2\"","3/8\"","#4","#8","#16","#30","#50","#100","#200"]
[{"$f":"IF(Initial_Info1!B28=\"\",\"\",Initial_Info1!B28)","v":""},{"$f":"IF(Initial_Info1!C28=\"\",\"\",Initial_Info1!C28)","v":0},null,{"$f":"IF(Initial_Info1!I28=\"\",\"\",Initial_Info1!G28)","v":0},null,{"$f":"IF(MO_JMF_Std!AF4=\"\",1,MO_JMF_Std!AF4)","v":1},{"$f":"IF(MO_JMF_Std!AE4=\"\",1,MO_JMF_Std!AE4)","v":1},null,{"$f":"IF(E4>0,\"Yes\",\"No\")","v":"No"},null,null,null,null,null,null,null,null,null,null,null,null,null,null,null,null,null,"Max. Size",null,"Mix Type","MAX.",50,37.5,25,19,12.5,9.5,4.75,2.36,1.18,0.6,0.3,0.15,7.4999999999999997E-2]
[{"$f":"IF(Initial_Info1!B29=\"\",\"\",Initial_Info1!B29)","v":""},{"$f":"IF(Initial_Info1!C29=\"\",\"\",Initial_Info1!C29)","v":0},null,{"$f":"IF(Initial_Info1!I29=\"\",\"\",Initial_Info1!G29)","v":0},null,{"$f":"IF(MO_JMF_Std!AF5=\"\",1,MO_JMF_Std!AF5)","v":1},{"$f":"IF(MO_JMF_Std!AE5=\"\",1,MO_JMF_Std!AE5)","v":1},null,"No",null,null,null,null,null,null,null,null,null,null,null,null,null,null,null,null,null,{"$f":"VLOOKUP($AC$3,$AC$5:$AD$30,2,)","v":0},null,"BB",25,null,null,100,100,90,null,65,50,null,35,null,null,12]
[{"$f":"IF(Initial_Info1!B30=\"\",\"\",Initial_Info1!B30)","v":""},{"$f":"IF(Initial_Info1!C30=\"\",\"\",Initial_Info1!C30)","v":0},null,{"$f":"IF(Initial_Info1!I30=\"\",\"\",Initial_Info1!G30)","v":0},null,{"$f":"IF(MO_JMF_Std!AF6=\"\",1,MO_JMF_Std!AF6)","v":1},{"$f":"IF(MO_JMF_Std!AE6=\"\",1,MO_JMF_Std!AE6)","v":1},null,"No",null,null,null,null,null,null,null,null,null,null,null,null,null,null,null,null,null,null,null,"BP-1",19,null,null,null,null,100,null,70,55,null,30,null,null,12]
[{"$f":"IF(Initial_Info1!B31=\"\",\"\",Initial_Info1!B31)","v":""},{"$f":"IF(Initial_Info1!C31=\"\",\"\",Initial_Info1!C31)","v":0},null,{"$f":"IF(Initial_Info1!I31=\"\",\"\",Initial_Info1!G31)","v":0},null,{"$f":"IF(MO_JMF_Std!AF7=\"\",1,MO_JMF_Std!AF7)","v":1},{"$f":"IF(MO_JMF_Std!AE7=\"\",1,MO_JMF_Std!AE7)","v":1},null,"No",null,null,null,null,null,null,null,null,null,null,null,null,null,null,null,null,null,"N-P Sieve",null,"BP-2",12.5,null,null,null,null,100,null,90,70,null,35,null,null,12]
[{"$f":"IF(Initial_Info1!B32=\"\",\"\",Initial_Info1!B32)","v":""},{"$f":"IF(Initial_Info1!C32=\"\",\"\",Initial_Info1!C32)","v":0},null,{"$f":"IF(Initial_Info1!I32=\"\",\"\",Initial_Info1!G32)","v":0},null,{"$f":"IF(MO_JMF_Std!AF8=\"\",1,MO_JMF_Std!AF8)","v":1},{"$f":"IF(MO_JMF_Std!AE8=\"\",1,MO_JMF_Std!AE8)","v":1},null,"No",null,null,null,null,null,null,null,null,null,null,null,null,null,null,null,null,null,null,null,"BP-3",9.5,null,null,null,null,100,null,100,null,60,null,null,null,12]
[{"$f":"IF(Initial_Info1!B35=\"\",\"\",Initial_Info1!B35)","v":""},{"$f":"IF(Initial_Info1!C35=\"\",\"\",Initial_Info1!C35)","v":0},null,{"$f":"IF(Initial_Info1!I35=\"\",\"\",Initial_Info1!G35)","v":0},null,{"$f":"IF(MO_JMF_Std!AF9=\"\",1,MO_JMF_Std!AF9)","v":1},{"$f":"IF(MO_JMF_Std!AE9=\"\",1,MO_JMF_Std!AE9)","v":1},null,"No",null,null,null,null,null,null,null,null,null,null,null,null,null,null,null,null,null,null,null,"SL",12.5,null,null,null,100,100,100,90,70,null,35,null,null,12]
[{"$f":"IF(Initial_Info1!B36=\"\",\"\",Initial_Info1!B36)","v":""},{"$f":"IF(Initial_Info1!C36=\"\",\"\",Initial_Info1!C36)","v":0},null,{"$f":"IF(Initial_Info1!I36=\"\",\"\",Initial_Info1!G36)","v":0},null,{"$f":"IF(MO_JMF_Std!AF10=\"\",1,MO_JMF_Std!AF10)","v":1},{"$f":"IF(MO_JMF_Std!AE10=\"\",1,MO_JMF_Std!AE10)","v":1},null,"No",null,null,null,null,null,null,null,null,null,null,null,null,null,null,null,null,null,null,null,"SP048",9.5,null,null,null,null,null,100,100,null,60,null,null,null,12]
[{"$f":"IF(Initial_Info1!B37=\"\",\"\",Initial_Info1!B37)","v":""},{"$f":"IF(Initial_Info1!C37=\"\",\"\",Initial_Info1!C37)","v":0},null,{"$f":"IF(Initial_Info1!I37=\"\",\"\",Initial_Info1!G37)","v":0},null,{"$f":"IF(MO_JMF_Std!AF11=\"\",1,MO_JMF_Std!AF11)","v":1},{"$f":"IF(MO_JMF_Std!AE11=\"\",1,MO_JMF_Std!AE11)","v":1},null,"No",null,null,null,null,null,null,null,null,null,null,null,null,null,null,null,null,null,null,null,"SP095",12.5,null,null,null,null,100,100,90,67,null,null,null,null,10]
[{"$f":"IF(Initial_Info1!B38=\"\",\"\",Initial_Info1!B38)","v":""},{"$f":"IF(Initial_Info1!C38=\"\",\"\",Initial_Info1!C38)","v":0},null,{"$f":"IF(Initial_Info1!I38=\"\",\"\",Initial_Info1!G38)","v":0},null,{"$f":"IF(MO_JMF_Std!AF12=\"\",1,MO_JMF_Std!AF12)","v":1},{"$f":"IF(MO_JMF_Std!AE12=\"\",1,MO_JMF_Std!AE12)","v":1},null,"No",null,null,null,null,null,null,null,null,null,null,null,null,null,null,null,null,null,null,null,"SP095SM",12.5,null,null,null,null,100,95,50,30,21,18,15,null,12]
[{"$f":"IF(Initial_Info1!B39=\"\",\"\",Initial_Info1!B39)","v":""},{"$f":"IF(Initial_Info1!C39=\"\",\"\",Initial_Info1!C39)","v":0},null,{"$f":"IF(Initial_Info1!I39=\"\",\"\",Initial_Info1!G39)","v":0},null,{"$f":"IF(MO_JMF_Std!AF13=\"\",1,MO_JMF_Std!AF13)","v":1},{"$f":"IF(MO_JMF_Std!AE13=\"\",1,MO_JMF_Std!AE13)","v":1},null,"No",null,null,null,null,null,null,null,null,null,null,null,null,null,null,null,null,null,null,null,"SP125",19,null,null,null,100,100,90,null,58,null,null,null,null,10]
[{"$f":"IF(Initial_Info1!B42=\"\",\"\",Initial_Info1!B42)","v":""},{"$f":"IF(Initial_Info1!C42=\"\",\"\",Initial_Info1!C42&\", \"&Initial_Info1!D42)","v":"0, 0"},null,{"$f":"IF(Initial_Info1!E42=\"\",\"\",Initial_Info1!E42)","v":0},null,{"$f":"IF(MO_JMF_Std!AF14=\"\",1,MO_JMF_Std!AF14)","v":1},{"$f":"IF(MO_JMF_Std!AE14=\"\",1,MO_JMF_Std!AE14)","v":1},null,"No",null,null,null,null,null,null,null,null,null,null,null,null,null,null,null,null,null,null,null,"SP125SM",19,null,null,null,100,100,80,35,24,null,null,null,null,11]
[{"$f":"IF(Initial_Info1!B43=\"\",\"\",Initial_Info1!B43)","v":""},{"$f":"IF(Initial_Info1!C43=\"\",\"\",Initial_Info1!C43&\", \"&Initial_Info1!D43)","v":"0, 0"},null,{"$f":"IF(Initial_Info1!E43=\"\",\"\",Initial_Info1!E43)","v":0},null,{"$f":"IF(MO_JMF_Std!AF15=\"\",1,MO_JMF_Std!AF15)","v":1},{"$f":"IF(MO_JMF_Std!AE15=\"\",1,MO_JMF_Std!AE15)","v":1},null,"No",null,null,null,null,null,null,null,null,null,null,null,null,null,null,null,null,null,null,null,"SP190",25,null,null,100,100,90,null,null,49,null,null,null,null,8]
[{"$f":"IF(Initial_Info1!B44=\"\",\"\",Initial_Info1!B44)","v":""},{"$f":"IF(Initial_Info1!C44=\"\",\"\",Initial_Info1!C44&\", \"&Initial_Info1!D44)","v":"0, 0"},null,{"$f":"IF(Initial_Info1!E44=\"\",\"\",Initial_Info1!E44)","v":0},null,{"$f":"IF(MO_JMF_Std!AF16=\"\",1,MO_JMF_Std!AF16)","v":1},{"$f":"IF(MO_JMF_Std!AE16=\"\",1,MO_JMF_Std!AE16)","v":1},null,"No",null,null,null,null,null,null,null,null,null,null,null,null,null,null,null,null,null,null,null,"SP250",37.5,null,100,100,90,null,null,null,45,null,null,null,null,7]
[{"$f":"IF(Initial_Info1!B45=\"\",\"\",Initial_Info1!B45)","v":""},{"$f":"IF(Initial_Info1!C45=\"\",\"\",Initial_Info1!C45&\", \"&Initial_Info1!D45)","v":"0, 0"},null,{"$f":"IF(Initial_Info1!E45=\"\",\"\",Initial_Info1!E45)","v":0},null,{"$f":"IF(MO_JMF_Std!AF17=\"\",1,MO_JMF_Std!AF17)","v":1},{"$f":"IF(MO_JMF_Std!AE17=\"\",1,MO_JMF_Std!AE17)","v":1},null,"No",null,null,null,null,null,null,null,null,null,null,null,null,null,null,null,null,null,null,null,"SP375",50,100,100,90,null,null,null,null,41,null,null,null,null,6]
[{"$f":"IF(Initial_Info1!B48=\"\",\"\",Initial_Info1!B48)","v":""},{"$f":"IF(Initial_Info1!C48=\"\",\"\",Initial_Info1!C48&\", \"&Initial_Info1!D48)","v":"INNOPHOS, INC., CRANBURY, NJ"},null,{"$f":"IF(Initial_Info1!E48=\"\",\"\",Initial_Info1!E48)","v":"Anti-Strip"},null,{"$f":"IF(MO_JMF_Std!AF18=\"\",1,MO_JMF_Std!AF18)","v":1},{"$f":"IF(MO_JMF_Std!AE18=\"\",1,MO_JMF_Std!AE18)","v":1},"AGG COST","No",null,null,null,null,null,null,null,null,null,null,null,null,null,null,null,null,null,null,null,"UBAWS - A",9.5,null,null,null,null,null,100,55,32,25,18,13,10,6]
[{"$f":"IF(Initial_Info1!B49=\"\",\"\",Initial_Info1!B49)","v":""},{"$f":"IF(Initial_Info1!C49=\"\",\"\",Initial_Info1!C49&\", \"&Initial_Info1!D49)","v":"INNOPHOS, INC., CRANBURY, NJ"},null,{"$f":"IF(Initial_Info1!E49=\"\",\"\",Initial_Info1!E49)","v":"Anti-Strip"},null,{"$f":"IF(MO_JMF_Std!AF19=\"\",1,MO_JMF_Std!AF19)","v":1},{"$f":"IF(MO_JMF_Std!AE19=\"\",1,MO_JMF_Std!AE19)","v":1},{"$f":"IF(Cost_Analysis!F22=\"\",\"\",Cost_Analysis!F22)","v":{"$error":"#DIV/0!"}},"No",null,null,null,null,null,null,null,null,null,null,null,null,null,null,null,null,null,null,null,"UBAWS - B",12.5,null,null,null,100,100,100,41,27,23,18,13,10,6]
[{"$f":"IF(Initial_Info1!B24=\"\",\"\",Initial_Info1!B24)","v":""},{"$f":"IF(Initial_Info1!C24=\"\",\"\",Initial_Info1!C24&\", \"&Initial_Info1!D24)","v":"INNOPHOS, INC., CRANBURY, NJ"},null,{"$f":"IF(Initial_Info1!E24=\"\",\"\",Initial_Info1!E24)","v":"INNOVALT W"},{"$f":"Initial_Info1!H24","v":0},1,1,"MIX COST","No",null,null,null,null,null,null,null,null,null,null,null,null,null,null,null,null,null,null,null,"UBAWS - C",19,null,null,null,100,100,80,41,27,23,18,13,10,6]
[null,null,"COLD FEED TOTAL %",null,{"$f":"SUM(E4:E20)","v":0},null,null,{"$f":"Cost_Analysis!F22+Cost_Analysis!F33","v":{"$error":"#DIV/0!"}},null,null,null,null,null,null,null,null,null,null,null,null,null,null,null,null,null,null,null,null,{"$f":"Initial_Info1!AD18","v":"STL - C"},19,null,null,null,100,100,95,70,55,null,30,null,null,10]
["COMBINED APPARENT Specific Gravity:",null,null,{"$f":"SUM(E4:E19)/((E4/F4)+(E5/F5)+(E6/F6)+(E7/F7)+(E8/F8)+(E9/F9)+(E10/F10)+(E11/F11)+(E12/F12)+(E13/F13)+(E14/F14)+(E15/F15)+(E16/F16)+(E17/F17)+(E18/F18)+(E19/F19))","v":{"$error":"#DIV/0!"}},"COMBINED BULK SPECIFIC GRAVITY:",null,null,{"$f":"ROUND(SUM(E4:E19)/((E4/G4)+(E5/G5)+(E6/G6)+(E7/G7)+(E8/G8)+(E9/G9)+(E10/G10)+(E11/G11)+(E12/G12)+(E13/G13)+(E14/G14)+(E15/G15)+(E16/G16)+(E17/G17)+(E18/G18)+(E19/G19)),3)","v":{"$error":"#DIV/0!"}},null,null,null,null,null,null,null,null,null,null,null,null,null,null,null,null,null,null,null,null,{"$f":"Initial_Info1!AD19","v":"STL - D"},12.5,null,null,null,null,100,null,90,65,null,30,null,null,10]
[null,null,null,null,null,null,null,null,null,null,null,null,null,null,null,null,null,null,null,null,null,null,null,null,null,null,null,null,{"$f":"Initial_Info1!AD20","v":"STL - X"},25,null,null,100,null,90,null,65,50,null,35,null,null,12]
["SIEVE SIZE","(US Std.)","2\"","1 1/2\"","1\"","3/4\"","1/2\"","3/8\"","#4","#8","#16","#30","#50","#100","#200",null,null,null,null,null,null,null,null,null,null,null,null,null,{"$f":"Initial_Info1!AD21","v":""}]
[null,"(mm)",50,37.5,25,19,12.5,9.5,4.75,2.36,1.18,0.6,0.3,0.15,7.4999999999999997E-2,null,null,null,null,null,null,null,null,null,null,null,null,null,{"$f":"Initial_Info1!AD22","v":""}]
["Sieve Size","(mm)^0.45",{"$f":"C25^0.45","v":5.8148230317277987},5.1087431744234335,4.2566996126039234,3.7621761023862978,3.116086507375345,2.754074108566122,2.0161002539629291,1.4716698795820382,1.0773254099250416,0.79463568224020453,0.58170736792793831,0.42583471830473674,0.31172925995349998,null,null,null,null,null,null,null,null,null,null,null,null,null,{"$f":"Initial_Info1!AD23","v":""}]
["% Passing","(by mass)",{"$f":"C86","v":0},{"$f":"D86","v":0},0,0,0,0,0,0,0,0,0,0,0,null,null,null,null,null,null,null,null,null,null,null,null,null,{"$f":"Initial_Info1!AD24","v":""}]
["% Passing","(by volume)",{"$f":"C43","v":{"$error":"#DIV/0!"}},{"$error":"#DIV/0!"},{"$error":"#DIV/0!"},{"$error":"#DIV/0!"},{"$error":"#DIV/0!"},{"$error":"#DIV/0!"},{"$error":"#DIV/0!"},{"$error":"#DIV/0!"},{"$error":"#DIV/0!"},{"$error":"#DIV/0!"},{"$error":"#DIV/0!"},{"$error":"#DIV/0!"},{"$error":"#DIV/0!"},null,null,null,null,null,null,null,null,null,null,null,null,null,{"$f":"Initial_Info1!AD25","v":""}]
["Individual %","retained",{"$f":"100-C27","v":100},{"$f":"C27-D27","v":0},0,0,0,0,0,0,0,0,0,0,0,null,null,null,null,null,null,null,null,null,null,null,null,null,{"$f":"Initial_Info1!AD26","v":""}]
["SPECIFICATION LIMITS","maximum",{"$f":"IF(ISBLANK(INDEX($AC$5:$AQ$30,MATCH($AC$3,$AC$5:$AC$30,0),3)),\"\",INDEX($AC$5:$AQ$30,MATCH($AC$3,$AC$5:$AC$30,0),3))","v":""},{"$f":"IF(ISBLANK(INDEX($AC$5:$AQ$30,MATCH($AC$3,$AC$5:$AC$30,0),4)),\"\",INDEX($AC$5:$AQ$30,MATCH($AC$3,$AC$5:$AC$30,0),4))","v":""},{"$f":"IF(ISBLANK(INDEX($AC$5:$AQ$30,MATCH($AC$3,$AC$5:$AC$30,0),5)),\"\",INDEX($AC$5:$AQ$30,MATCH($AC$3,$AC$5:$AC$30,0),5))","v":""},{"$f":"IF(ISBLANK(INDEX($AC$5:$AQ$30,MATCH($AC$3,$AC$5:$AC$30,0),6)),\"\",INDEX($AC$5:$AQ$30,MATCH($AC$3,$AC$5:$AC$30,0),6))","v":""},{"$f":"IF(ISBLANK(INDEX($AC$5:$AQ$30,MATCH($AC$3,$AC$5:$AC$30,0),7)),\"\",INDEX($AC$5:$AQ$30,MATCH($AC$3,$AC$5:$AC$30,0),7))","v":""},{"$f":"IF(ISBLANK(INDEX($AC$5:$AQ$30,MATCH($AC$3,$AC$5:$AC$30,0),8)),\"\",INDEX($AC$5:$AQ$30,MATCH($AC$3,$AC$5:$AC$30,0),8))","v":""},{"$f":"IF(ISBLANK(INDEX($AC$5:$AQ$30,MATCH($AC$3,$AC$5:$AC$30,0),9)),\"\",INDEX($AC$5:$AQ$30,MATCH($AC$3,$AC$5:$AC$30,0),9))","v":""},{"$f":"IF(ISBLANK(INDEX($AC$5:$AQ$30,MATCH($AC$3,$AC$5:$AC$30,0),10)),\"\",INDEX($AC$5:$AQ$30,MATCH($AC$3,$AC$5:$AC$30,0),10))","v":""},{"$f":"IF(ISBLANK(INDEX($AC$5:$AQ$30,MATCH($AC$3,$AC$5:$AC$30,0),11)),\"\",INDEX($AC$5:$AQ$30,MATCH($AC$3,$AC$5:$AC$30,0),11))","v":""},{"$f":"IF(ISBLANK(INDEX($AC$5:$AQ$30,MATCH($AC$3,$AC$5:$AC$30,0),12)),\"\",INDEX($AC$5:$AQ$30,MATCH($AC$3,$AC$5:$AC$30,0),12))","v":""},{"$f":"IF(ISBLANK(INDEX($AC$5:$AQ$30,MATCH($AC$3,$AC$5:$AC$30,0),13)),\"\",INDEX($AC$5:$AQ$30,MATCH($AC$3,$AC$5:$AC$30,0),13))","v":""},{"$f":"IF(ISBLANK(INDEX($AC$5:$AQ$30,MATCH($AC$3,$AC$5:$AC$30,0),14)),\"\",INDEX($AC$5:$AQ$30,MATCH($AC$3,$AC$5:$AC$30,0),14))","v":""},{"$f":"IF(ISBLANK(INDEX($AC$5:$AQ$30,MATCH($AC$3,$AC$5:$AC$30,0),15)),\"\",INDEX($AC$5:$AQ$30,MATCH($AC$3,$AC$5:$AC$30,0),15))","v":""},null,null,null,null,null,null,null,null,null,null,null,null,null,{"$f":"Initial_Info1!AD27","v":""}]
[null,"minimum",{"$f":"IF(ISBLANK(INDEX($AC$32:$AQ$57,MATCH($AC$3,$AC$32:$AC$57,0),3)),\"\",INDEX($AC$32:$AQ$57,MATCH($AC$3,$AC$32:$AC$57,0),3))","v":""},{"$f":"IF(ISBLANK(INDEX($AC$32:$AQ$57,MATCH($AC$3,$AC$32:$AC$57,0),4)),\"\",INDEX($AC$32:$AQ$57,MATCH($AC$3,$AC$32:$AC$57,0),4))","v":""},{"$f":"IF(ISBLANK(INDEX($AC$32:$AQ$57,MATCH($AC$3,$AC$32:$AC$57,0),5)),\"\",INDEX($AC$32:$AQ$57,MATCH($AC$3,$AC$32:$AC$57,0),5))","v":""},{"$f":"IF(ISBLANK(INDEX($AC$32:$AQ$57,MATCH($AC$3,$AC$32:$AC$57,0),6)),\"\",INDEX($AC$32:$AQ$57,MATCH($AC$3,$AC$32:$AC$57,0),6))","v":""},{"$f":"IF(ISBLANK(INDEX($AC$32:$AQ$57,MATCH($AC$3,$AC$32:$AC$57,0),7)),\"\",INDEX($AC$32:$AQ$57,MATCH($AC$3,$AC$32:$AC$57,0),7))","v":""},{"$f":"IF(ISBLANK(INDEX($AC$32:$AQ$57,MATCH($AC$3,$AC$32:$AC$57,0),8)),\"\",INDEX($AC$32:$AQ$57,MATCH($AC$3,$AC$32:$AC$57,0),8))","v":""},{"$f":"IF(ISBLANK(INDEX($AC$32:$AQ$57,MATCH($AC$3,$AC$32:$AC$57,0),9)),\"\",INDEX($AC$32:$AQ$57,MATCH($AC$3,$AC$32:$AC$57,0),9))","v":""},{"$f":"IF(ISBLANK(INDEX($AC$32:$AQ$57,MATCH($AC$3,$AC$32:$AC$57,0),10)),\"\",INDEX($AC$32:$AQ$57,MATCH($AC$3,$AC$32:$AC$57,0),10))","v":""},{"$f":"IF(ISBLANK(INDEX($AC$32:$AQ$57,MATCH($AC$3,$AC$32:$AC$57,0),11)),\"\",INDEX($AC$32:$AQ$57,MATCH($AC$3,$AC$32:$AC$57,0),11))","v":""},{"$f":"IF(ISBLANK(INDEX($AC$32:$AQ$57,MATCH($AC$3,$AC$32:$AC$57,0),12)),\"\",INDEX($AC$32:$AQ$57,MATCH($AC$3,$AC$32:$AC$57,0),12))","v":""},{"$f":"IF(ISBLANK(INDEX($AC$32:$AQ$57,MATCH($AC$3,$AC$32:$AC$57,0),13)),\"\",INDEX($AC$32:$AQ$57,MATCH($AC$3,$AC$32:$AC$57,0),13))","v":""},{"$f":"IF(ISBLANK(INDEX($AC$32:$AQ$57,MATCH($AC$3,$AC$32:$AC$57,0),14)),\"\",INDEX($AC$32:$AQ$57,MATCH($AC$3,$AC$32:$AC$57,0),14))","v":""},{"$f":"IF(ISBLANK(INDEX($AC$32:$AQ$57,MATCH($AC$3,$AC$32:$AC$57,0),15)),\"\",INDEX($AC$32:$AQ$57,MATCH($AC$3,$AC$32:$AC$57,0),15))","v":""},null,null,null,null,null,null,null,null,null,null,null,null,null,null,null,null,null,null,"Minimum Specification"]
["COMBINED GRADATION",null,{"$f":"C86","v":0},{"$f":"D86","v":0},0,0,0,0,0,0,0,0,0,0,0,null,null,null,null,null,null,null,null,null,null,null,null,null,"BB",25,null,null,null,85,60,null,35,25,null,10,null,null,4]
[null,"Max.  Den.",{"$f":"IF($AA$5>=C25,(C25/$AA$5)^0.45*100,100)","v":100},100,100,100,100,100,100,100,100,100,100,100,100,null,null,null,null,null,null,null,null,null,null,null,null,null,"BP-1",19,null,null,null,null,85,null,50,30,null,10,null,null,5]
[null,"Label x-axis",0,0,0,0,0,0,0,0,0,0,0,0,0,null,null,null,null,null,null,null,null,null,null,null,null,null,"BP-2",12.5,null,null,null,null,95,null,60,40,null,15,null,null,5]
[null,null,null,null,null,null,null,null,null,null,null,null,null,null,null,null,null,null,null,null,null,null,null,null,null,null,null,null,"BP-3",9.5,null,null,null,null,null,null,90,null,30,null,null,null,7]
[null,null,null,null,"Blend Percent by Volume of Aggregate",null,null,null,null,null,null,null,null,null,null,null,null,null,null,null,null,null,null,null,null,null,null,null,"SL",12.5,null,null,null,null,99,90,60,40,null,15,null,null,5]
[null,null,null,null,null,null,null,null,null,null,null,null,null,null,null,null,null,null,null,null,null,null,null,null,null,null,null,null,"SP048",9.5,null,null,null,null,null,null,90,null,30,null,null,null,7]
["SIEVE SIZE","(US Std.)","2\"","1 1/2\"","1\"","3/4\"","1/2\"","3/8\"","#4","#8","#16","#30","#50","#100","#200","-#200","TOTAL  VOLUME",null,null,null,null,null,null,null,null,null,null,null,"SP095",12.5,null,null,null,null,null,90,null,32,null,null,null,null,2]
[null,"(mm)",50,37.5,25,19,12.5,9.5,4.75,2.36,1.18,0.6,0.3,0.15,7.4999999999999997E-2,"-0.075","RETAINED",null,null,null,null,null,null,null,null,null,null,null,"SP095SM",12.5,null,null,null,null,null,70,30,20,null,null,null,null,8]
["Individual ","Vol. Retained",{"$f":"C129","v":0},0,0,0,0,0,0,0,0,0,0,0,0,0,{"$f":"SUM(C40:P40)","v":0},null,null,null,null,null,null,null,null,null,null,null,"SP125",19,null,null,null,null,90,null,null,28,null,null,null,null,2]
["% VOLUME","RETAINED",{"$f":"C$40*100/$Q$40","v":{"$error":"#DIV/0!"}},{"$error":"#DIV/0!"},{"$error":"#DIV/0!"},{"$error":"#DIV/0!"},{"$error":"#DIV/0!"},{"$error":"#DIV/0!"},{"$error":"#DIV/0!"},{"$error":"#DIV/0!"},{"$error":"#DIV/0!"},{"$error":"#DIV/0!"},{"$error":"#DIV/0!"},{"$error":"#DIV/0!"},{"$error":"#DIV/0!"},{"$error":"#DIV/0!"},{"$f":"SUM(C41:P41)","v":{"$error":"#DIV/0!"}},null,null,null,null,null,null,null,null,null,null,null,"SP125SM",19,null,null,null,null,90,50,20,16,null,null,null,null,8]
["CUMULATIVE","%Vol.Retained",{"$f":"C41","v":{"$error":"#DIV/0!"}},{"$f":"SUM(C41:D41)","v":{"$error":"#DIV/0!"}},{"$f":"SUM(C41:E41)","v":{"$error":"#DIV/0!"}},{"$f":"SUM(C41:F41)","v":{"$error":"#DIV/0!"}},{"$f":"SUM(C41:G41)","v":{"$error":"#DIV/0!"}},{"$f":"SUM(C41:H41)","v":{"$error":"#DIV/0!"}},{"$f":"SUM(C41:I41)","v":{"$error":"#DIV/0!"}},{"$f":"SUM(C41:J41)","v":{"$error":"#DIV/0!"}},{"$f":"SUM(C41:K41)","v":{"$error":"#DIV/0!"}},{"$f":"SUM(C41:L41)","v":{"$error":"#DIV/0!"}},{"$f":"SUM(C41:M41)","v":{"$error":"#DIV/0!"}},{"$f":"SUM(C41:N41)","v":{"$error":"#DIV/0!"}},{"$f":"SUM(C41:O41)","v":{"$error":"#DIV/0!"}},{"$f":"SUM(C41:P41)","v":{"$error":"#DIV/0!"}},null,null,null,null,null,null,null,null,null,null,null,null,"SP190",25,null,null,null,90,null,null,null,23,null,null,null,null,2]
["%Passing","by VOLUME",{"$f":"100-C$42","v":{"$error":"#DIV/0!"}},{"$error":"#DIV/0!"},{"$error":"#DIV/0!"},{"$error":"#DIV/0!"},{"$error":"#DIV/0!"},{"$error":"#DIV/0!"},{"$error":"#DIV/0!"},{"$error":"#DIV/0!"},{"$error":"#DIV/0!"},{"$error":"#DIV/0!"},{"$error":"#DIV/0!"},{"$error":"#DIV/0!"},{"$error":"#DIV/0!"},{"$error":"#DIV/0!"},null,null,null,null,null,null,null,null,null,null,null,null,"SP250",37.5,null,null,90,null,null,null,null,19,null,null,null,null,1]
[null,null,null,null,null,null,null,null,null,null,null,null,null,null,null,null,null,null,null,null,null,null,null,null,null,null,null,null,"SP325",50,null,90,null,null,null,null,null,15,null,null,null,null,0]
[null,null,null,null,"Individual Percent Passing by Weight of Aggregate",null,null,null,null,null,null,null,null,null,null,null,null,null,null,null,null,null,null,null,null,null,null,null,"UBAWS - A",9.5,null,null,null,null,null,null,40,22,15,null,null,null,4]
[null,null,null,null,null,null,null,null,null,null,null,null,null,null,null,null,null,null,null,null,null,null,null,null,null,null,null,null,"UBAWS - B",12.5,null,null,null,null,97,75,25,17,null,null,null,null,4]
["SIEVE SIZE","(US Std.)","2\"","1 1/2\"","1\"","3/4\"","1/2\"","3/8\"","#4","#8","#16","#30","#50","#100","#200",null,null,null,null,null,null,null,null,null,null,null,null,null,"UBAWS - C",19,null,null,null,null,85,50,25,17,null,null,null,null,4]
[null,"(mm)",50,37.5,25,19,12.5,9.5,4.75,2.36,1.18,0.6,0.3,0.15,7.4999999999999997E-2,null,null,null,null,null,null,null,null,null,null,null,null,null,{"$f":"Initial_Info1!AD18","v":"STL - C"},19,null,null,null,null,92,75,45,30,null,12,null,null,2]
[{"$f":"$A$4","v":""},"% Passing",{"$f":"Initial_Info1!$L28","v":0},{"$f":"Initial_Info1!$M28","v":0},{"$f":"Initial_Info1!$N28","v":0},{"$f":"Initial_Info1!$O28","v":0},{"$f":"Initial_Info1!$P28","v":0},{"$f":"Initial_Info1!$Q28","v":0},{"$f":"Initial_Info1!$R28","v":0},{"$f":"Initial_Info1!$S28","v":0},{"$f":"Initial_Info1!$T28","v":0},{"$f":"Initial_Info1!$U28","v":0},{"$f":"Initial_Info1!$V28","v":0},{"$f":"Initial_Info1!$W28","v":0},{"$f":"Initial_Info1!$X28","v":0},null,null,null,null,null,null,null,null,null,null,null,null,null,{"$f":"Initial_Info1!AD19","v":"STL - D"},12.5,null,null,null,null,null,null,60,35,null,10,null,null,2]
[{"$f":"$A$5","v":""},"% Passing",{"$f":"Initial_Info1!$L29","v":0},{"$f":"Initial_Info1!$M29","v":0},{"$f":"Initial_Info1!$N29","v":0},{"$f":"Initial_Info1!$O29","v":0},{"$f":"Initial_Info1!$P29","v":0},{"$f":"Initial_Info1!$Q29","v":0},{"$f":"Initial_Info1!$R29","v":0},{"$f":"Initial_Info1!$S29","v":0},{"$f":"Initial_Info1!$T29","v":0},{"$f":"Initial_Info1!$U29","v":0},{"$f":"Initial_Info1!$V29","v":0},{"$f":"Initial_Info1!$W29","v":0},{"$f":"Initial_Info1!$X29","v":0},null,null,null,null,null,null,null,null,null,null,null,null,null,{"$f":"Initial_Info1!AD20","v":"STL - X"},25,null,null,null,null,60,null,35,25,null,10,null,null,2]
[{"$f":"$A$6","v":""},"% Passing",{"$f":"Initial_Info1!$L30","v":0},{"$f":"Initial_Info1!$M30","v":0},{"$f":"Initial_Info1!$N30","v":0},{"$f":"Initial_Info1!$O30","v":0},{"$f":"Initial_Info1!$P30","v":0},{"$f":"Initial_Info1!$Q30","v":0},{"$f":"Initial_Info1!$R30","v":0},{"$f":"Initial_Info1!$S30","v":0},{"$f":"Initial_Info1!$T30","v":0},{"$f":"Initial_Info1!$U30","v":0},{"$f":"Initial_Info1!$V30","v":0},{"$f":"Initial_Info1!$W30","v":0},{"$f":"Initial_Info1!$X30","v":0},null,null,null,null,null,null,null,null,null,null,null,null,null,{"$f":"Initial_Info1!AD21","v":""}]
[{"$f":"$A$7","v":""},"% Passing",{"$f":"Initial_Info1!$L31","v":0},{"$f":"Initial_Info1!$M31","v":0},{"$f":"Initial_Info1!$N31","v":0},{"$f":"Initial_Info1!$O31","v":0},{"$f":"Initial_Info1!$P31","v":0},{"$f":"Initial_Info1!$Q31","v":0},{"$f":"Initial_Info1!$R31","v":0},{"$f":"Initial_Info1!$S31","v":0},{"$f":"Initial_Info1!$T31","v":0},{"$f":"Initial_Info1!$U31","v":0},{"$f":"Initial_Info1!$V31","v":0},{"$f":"Initial_Info1!$W31","v":0},{"$f":"Initial_Info1!$X31","v":0},null,null,null,null,null,null,null,null,null,null,null,null,null,{"$f":"Initial_Info1!AD22","v":""}]
[{"$f":"$A$8","v":""},"% Passing",{"$f":"Initial_Info1!$L32","v":0},{"$f":"Initial_Info1!$M32","v":0},{"$f":"Initial_Info1!$N32","v":0},{"$f":"Initial_Info1!$O32","v":0},{"$f":"Initial_Info1!$P32","v":0},{"$f":"Initial_Info1!$Q32","v":0},{"$f":"Initial_Info1!$R32","v":0},{"$f":"Initial_Info1!$S32","v":0},{"$f":"Initial_Info1!$T32","v":0},{"$f":"Initial_Info1!$U32","v":0},{"$f":"Initial_Info1!$V32","v":0},{"$f":"Initial_Info1!$W32","v":0},{"$f":"Initial_Info1!$X32","v":0},null,null,null,null,null,null,null,null,null,null,null,null,null,{"$f":"Initial_Info1!AD23","v":""}]
[{"$f":"$A$9","v":""},"% Passing",{"$f":"Initial_Info1!$L35","v":0},{"$f":"Initial_Info1!$M35","v":0},{"$f":"Initial_Info1!$N35","v":0},{"$f":"Initial_Info1!$O35","v":0},{"$f":"Initial_Info1!$P35","v":0},{"$f":"Initial_Info1!$Q35","v":0},{"$f":"Initial_Info1!$R35","v":0},{"$f":"Initial_Info1!$S35","v":0},{"$f":"Initial_Info1!$T35","v":0},{"$f":"Initial_Info1!$U35","v":0},{"$f":"Initial_Info1!$V35","v":0},{"$f":"Initial_Info1!$W35","v":0},{"$f":"Initial_Info1!$X35","v":0},null,null,null,null,null,null,null,null,null,null,null,null,null,{"$f":"Initial_Info1!AD24","v":""}]
[{"$f":"$A$10","v":""},"% Passing",{"$f":"Initial_Info1!$L36","v":0},{"$f":"Initial_Info1!$M36","v":0},{"$f":"Initial_Info1!$N36","v":0},{"$f":"Initial_Info1!$O36","v":0},{"$f":"Initial_Info1!$P36","v":0},{"$f":"Initial_Info1!$Q36","v":0},{"$f":"Initial_Info1!$R36","v":0},{"$f":"Initial_Info1!$S36","v":0},{"$f":"Initial_Info1!$T36","v":0},{"$f":"Initial_Info1!$U36","v":0},{"$f":"Initial_Info1!$V36","v":0},{"$f":"Initial_Info1!$W36","v":0},{"$f":"Initial_Info1!$X36","v":0},null,null,null,null,null,null,null,null,null,null,null,null,null,{"$f":"Initial_Info1!AD25","v":""}]
[{"$f":"$A$11","v":""},"% Passing",{"$f":"Initial_Info1!$L37","v":0},{"$f":"Initial_Info1!$M37","v":0},{"$f":"Initial_Info1!$N37","v":0},{"$f":"Initial_Info1!$O37","v":0},{"$f":"Initial_Info1!$P37","v":0},{"$f":"Initial_Info1!$Q37","v":0},{"$f":"Initial_Info1!$R37","v":0},{"$f":"Initial_Info1!$S37","v":0},{"$f":"Initial_Info1!$T37","v":0},{"$f":"Initial_Info1!$U37","v":0},{"$f":"Initial_Info1!$V37","v":0},{"$f":"Initial_Info1!$W37","v":0},{"$f":"Initial_Info1!$X37","v":0},null,null,null,null,null,null,null,null,null,null,null,null,null,{"$f":"Initial_Info1!AD26","v":""}]
[{"$f":"$A$12","v":""},"% Passing",{"$f":"Initial_Info1!$L38","v":0},{"$f":"Initial_Info1!$M38","v":0},{"$f":"Initial_Info1!$N38","v":0},{"$f":"Initial_Info1!$O38","v":0},{"$f":"Initial_Info1!$P38","v":0},{"$f":"Initial_Info1!$Q38","v":0},{"$f":"Initial_Info1!$R38","v":0},{"$f":"Initial_Info1!$S38","v":0},{"$f":"Initial_Info1!$T38","v":0},{"$f":"Initial_Info1!$U38","v":0},{"$f":"Initial_Info1!$V38","v":0},{"$f":"Initial_Info1!$W38","v":0},{"$f":"Initial_Info1!$X38","v":0},null,null,null,null,null,null,null,null,null,null,null,null,null,{"$f":"Initial_Info1!AD27","v":""}]
[{"$f":"$A$13","v":""},"% Passing",{"$f":"Initial_Info1!$L39","v":0},{"$f":"Initial_Info1!$M39","v":0},{"$f":"Initial_Info1!$N39","v":0},{"$f":"Initial_Info1!$O39","v":0},{"$f":"Initial_Info1!$P39","v":0},{"$f":"Initial_Info1!$Q39","v":0},{"$f":"Initial_Info1!$R39","v":0},{"$f":"Initial_Info1!$S39","v":0},{"$f":"Initial_Info1!$T39","v":0},{"$f":"Initial_Info1!$U39","v":0},{"$f":"Initial_Info1!$V39","v":0},{"$f":"Initial_Info1!$W39","v":0},{"$f":"Initial_Info1!$X39","v":0},null,null,null,null,null,null,null,null,null,null,null,null,null,null,null,"2\"","1 1/2\"","1\"","3/4\"","1/2\"","3/8\"","#4","#8","#16","#30","#50","#100","#200"]
[{"$f":"$A$14","v":""},"% Passing",{"$f":"Initial_Info1!$L42","v":0},{"$f":"Initial_Info1!$M42","v":0},{"$f":"Initial_Info1!$N42","v":0},{"$f":"Initial_Info1!$O42","v":0},{"$f":"Initial_Info1!$P42","v":0},{"$f":"Initial_Info1!$Q42","v":0},{"$f":"Initial_Info1!$R42","v":0},{"$f":"Initial_Info1!$S42","v":0},{"$f":"Initial_Info1!$T42","v":0},{"$f":"Initial_Info1!$U42","v":0},{"$f":"Initial_Info1!$V42","v":0},{"$f":"Initial_Info1!$W42","v":0},{"$f":"Initial_Info1!$X42","v":0},null,null,null,null,null,null,null,null,null,null,null,null,null,null,null,50,37.5,25,19,12.5,9.5,4.75,2.36,1.18,0.6,0.3,0.15,7.4999999999999997E-2]
[{"$f":"$A$15","v":""},"% Passing",{"$f":"Initial_Info1!$L43","v":0},{"$f":"Initial_Info1!$M43","v":0},{"$f":"Initial_Info1!$N43","v":0},{"$f":"Initial_Info1!$O43","v":0},{"$f":"Initial_Info1!$P43","v":0},{"$f":"Initial_Info1!$Q43","v":0},{"$f":"Initial_Info1!$R43","v":0},{"$f":"Initial_Info1!$S43","v":0},{"$f":"Initial_Info1!$T43","v":0},{"$f":"Initial_Info1!$U43","v":0},{"$f":"Initial_Info1!$V43","v":0},{"$f":"Initial_Info1!$W43","v":0},{"$f":"Initial_Info1!$X43","v":0}]
[{"$f":"$A$16","v":""},"% Passing",{"$f":"Initial_Info1!$L44","v":0},{"$f":"Initial_Info1!$M44","v":0},{"$f":"Initial_Info1!$N44","v":0},{"$f":"Initial_Info1!$O44","v":0},{"$f":"Initial_Info1!$P44","v":0},{"$f":"Initial_Info1!$Q44","v":0},{"$f":"Initial_Info1!$R44","v":0},{"$f":"Initial_Info1!$S44","v":0},{"$f":"Initial_Info1!$T44","v":0},{"$f":"Initial_Info1!$U44","v":0},{"$f":"Initial_Info1!$V44","v":0},{"$f":"Initial_Info1!$W44","v":0},{"$f":"Initial_Info1!$X44","v":0},null,null,null,null,null,null,null,null,null,null,null,null,null,"LP/SM","All","UBAWS","SMR","B>30","B<30"]
[{"$f":"$A$17","v":""},"% Passing",{"$f":"Initial_Info1!$L45","v":0},{"$f":"Initial_Info1!$M45","v":0},{"$f":"Initial_Info1!$N45","v":0},{"$f":"Initial_Info1!$O45","v":0},{"$f":"Initial_Info1!$P45","v":0},{"$f":"Initial_Info1!$Q45","v":0},{"$f":"Initial_Info1!$R45","v":0},{"$f":"Initial_Info1!$S45","v":0},{"$f":"Initial_Info1!$T45","v":0},{"$f":"Initial_Info1!$U45","v":0},{"$f":"Initial_Info1!$V45","v":0},{"$f":"Initial_Info1!$W45","v":0},{"$f":"Initial_Info1!$X45","v":0},null,null,null,null,null,null,null,null,null,null,null,null,9.5,"#30","#4",true,true,false,false]
[{"$f":"$A$18","v":""},"% Passing",100,100,100,100,100,{"$f":"Initial_Info1!$Q48","v":0},{"$f":"Initial_Info1!$R48","v":0},{"$f":"Initial_Info1!$S48","v":0},{"$f":"Initial_Info1!$T48","v":0},{"$f":"Initial_Info1!$U48","v":0},{"$f":"Initial_Info1!$V48","v":0},{"$f":"Initial_Info1!$W48","v":0},{"$f":"Initial_Info1!$X48","v":0},null,null,null,null,null,null,null,null,null,null,null,null,12.5,"#16","#4",true,true,false,false]
[{"$f":"$A$19","v":""},"% Passing",100,100,100,100,100,{"$f":"Initial_Info1!$Q49","v":0},{"$f":"Initial_Info1!$R49","v":0},{"$f":"Initial_Info1!$S49","v":0},{"$f":"Initial_Info1!$T49","v":0},{"$f":"Initial_Info1!$U49","v":0},{"$f":"Initial_Info1!$V49","v":0},{"$f":"Initial_Info1!$W49","v":0},{"$f":"Initial_Info1!$X49","v":0},null,null,null,null,null,null,null,null,null,null,null,null,19,"#8","#4",true,true,false,true]
[]
[null,null,null,null,"Blend Percent Passing by Weight of Aggregate",null,null,null,null,null,null,null,null,null,null,null,null,null,null,null,null,null,null,null,null,null,null,"Non-Polish Sieve",{"$f":"IF(OR(RIGHT(AC2,2)=\"LP\",RIGHT(AC2,2)=\"SM\"),VLOOKUP(AA5,AB62:AD64,2),VLOOKUP(AA5,AB62:AD64,3))","v":{"$error":"#N/A"}},{"$f":"IF(OR(LEFT(AC2,3)=\"UBA\",RIGHT(AC2,3)=\"SMR\",AC66<>\"#4\"),TRUE,IF(AND(Blending!AA5>12.5,Initial_Info1!F5<=30),TRUE,FALSE))","v":{"$error":"#N/A"}}]
[]
["SIEVE SIZE","(US Std.)","2\"","1 1/2\"","1\"","3/4\"","1/2\"","3/8\"","#4","#8","#16","#30","#50","#100","#200"]
[null,"(mm)",50,37.5,25,19,12.5,9.5,4.75,2.36,1.18,0.6,0.3,0.15,7.4999999999999997E-2]
[{"$f":"$A$4","v":""},"mix % passing",{"$f":"$E$4*C49/100","v":0},0,0,0,0,0,0,0,0,0,0,0,0]
[{"$f":"$A$5","v":""},"mix % passing",{"$f":"$E$5*C50/100","v":0},0,0,0,0,0,0,0,0,0,0,0,0]
[{"$f":"$A$6","v":""},"mix % passing",{"$f":"$E$6*C51/100","v":0},0,0,0,0,0,0,0,0,0,0,0,0]
[{"$f":"$A$7","v":""},"mix % passing",{"$f":"$E$7*C52/100","v":0},0,0,0,0,0,0,0,0,0,0,0,0]
[{"$f":"$A$8","v":""},"mix % passing",{"$f":"$E$8*C53/100","v":0},0,0,0,0,0,0,0,0,0,0,0,0]
[{"$f":"$A$9","v":""},"mix % passing",{"$f":"$E$9*C54/100","v":0},0,0,0,0,0,0,0,0,0,0,0,0]
[{"$f":"$A$10","v":""},"mix % passing",{"$f":"$E$10*C55/100","v":0},0,0,0,0,0,0,0,0,0,0,0,0]
[{"$f":"$A$11","v":""},"mix % passing",{"$f":"$E$11*C56/100","v":0},0,0,0,0,0,0,0,0,0,0,0,0]
[{"$f":"$A$12","v":""},"mix % passing",{"$f":"$E$12*C57/100","v":0},0,0,0,0,0,0,0,0,0,0,0,0]
[{"$f":"$A$13","v":""},"mix % passing",{"$f":"$E$13*C58/100","v":0},0,0,0,0,0,0,0,0,0,0,0,0]
[{"$f":"$A$14","v":""},"mix % passing",{"$f":"$E$14*C59/100","v":0},0,0,0,0,0,0,0,0,0,0,0,0]
[{"$f":"$A$15","v":""},"mix % passing",{"$f":"$E$15*C60/100","v":0},0,0,0,0,0,0,0,0,0,0,0,0]
[{"$f":"$A$16","v":""},"mix % passing",{"$f":"$E$16*C61/100","v":0},0,0,0,0,0,0,0,0,0,0,0,0]
[{"$f":"$A$17","v":""},"mix % passing",{"$f":"$E$17*C62/100","v":0},0,0,0,0,0,0,0,0,0,0,0,0]
[{"$f":"$A$18","v":""},"mix % passing",{"$f":"$E$18*C63/100","v":0},0,0,0,0,0,0,0,0,0,0,0,0]
[{"$f":"$A$19","v":""},"mix % passing",{"$f":"$E$19*C64/100","v":0},0,0,0,0,0,0,0,0,0,0,0,0]
["Combined","Gradation",{"$f":"ROUND(SUM(C$70:C$85),1)","v":0},{"$f":"ROUND(SUM(D$70:D$85),1)","v":0},0,0,0,0,0,0,0,0,0,0,0]
[]
[null,null,null,null,"Blend Percent Retained by Weight of Aggregate"]
[]
["SIEVE SIZE","(US Std.)","2\"","1 1/2\"","1\"","3/4\"","1/2\"","3/8\"","#4","#8","#16","#30","#50","#100","#200","-#200"]
[null,"(mm)",50,37.5,25,19,12.5,9.5,4.75,2.36,1.18,0.6,0.3,0.15,7.4999999999999997E-2,"-0.075"]
[{"$f":"$A$4","v":""},"mass %retain.",{"$f":"E4-C70","v":0},{"$f":"C70-D70","v":0},{"$f":"D70-E70","v":0},0,0,0,0,0,0,0,0,0,0,{"$f":"O70","v":0}]
[{"$f":"$A$5","v":""},"mass %retain.",0,{"$f":"C71-D71","v":0},0,0,0,0,0,0,0,0,0,0,0,0]
[{"$f":"$A$6","v":""},"mass %retain.",0,{"$f":"C72-D72","v":0},0,0,0,0,0,0,0,0,0,0,0,0]
[{"$f":"$A$7","v":""},"mass %retain.",0,{"$f":"C73-D73","v":0},0,0,0,0,0,0,0,0,0,0,0,0]
[{"$f":"$A$8","v":""},"mass %retain.",0,{"$f":"C74-D74","v":0},0,0,0,0,0,0,0,0,0,0,0,0]
[{"$f":"$A$9","v":""},"mass %retain.",0,{"$f":"C75-D75","v":0},0,0,0,0,0,0,0,0,0,0,0,0]
[{"$f":"$A$10","v":""},"mass %retain.",0,{"$f":"C76-D76","v":0},0,0,0,0,0,0,0,0,0,0,0,0]
[{"$f":"$A$11","v":""},"mass %retain.",0,{"$f":"C77-D77","v":0},0,0,0,0,0,0,0,0,0,0,0,0]
[{"$f":"$A$12","v":""},"mass %retain.",0,{"$f":"C78-D78","v":0},0,0,0,0,0,0,0,0,0,0,0,0]
[{"$f":"$A$13","v":""},"mass %retain.",0,{"$f":"C79-D79","v":0},0,0,0,0,0,0,0,0,0,0,0,0]
[{"$f":"$A$14","v":""},"mass %retain.",0,{"$f":"C80-D80","v":0},0,0,0,0,0,0,0,0,0,0,0,0]
[{"$f":"$A$15","v":""},"mass %retain.",0,{"$f":"C81-D81","v":0},0,0,0,0,0,0,0,0,0,0,0,0]
[{"$f":"$A$16","v":""},"mass %retain.",0,{"$f":"C82-D82","v":0},0,0,0,0,0,0,0,0,0,0,0,0]
[{"$f":"$A$17","v":""},"mass %retain.",0,{"$f":"C83-D83","v":0},0,0,0,0,0,0,0,0,0,0,0,0]
[{"$f":"$A$18","v":""},"mass %retain.",0,{"$f":"C84-D84","v":0},0,0,0,0,0,0,0,0,0,0,0,0]
[{"$f":"$A$19","v":""},"mass %retain.",0,{"$f":"C85-D85","v":0},0,0,0,0,0,0,0,0,0,0,0,0]
[]
[null,null,null,null,"Individual Retained by Volume of Aggregate"]
[]
["SIEVE SIZE","(US Std.)","2\"","1 1/2\"","1\"","3/4\"","1/2\"","3/8\"","#4","#8","#16","#30","#50","#100","#200","-#200"]
[null,"(mm)",50,37.5,25,19,12.5,9.5,4.75,2.36,1.18,0.6,0.3,0.15,7.4999999999999997E-2,"-0.075"]
[{"$f":"$A$4","v":""},"volume retain.",{"$f":"C92/$G$4","v":0},0,0,0,0,0,0,0,0,0,0,0,0,0]
[{"$f":"$A$5","v":""},"volume retain.",{"$f":"C93/$G$5","v":0},0,0,0,0,0,0,0,0,0,0,0,0,0]
[{"$f":"$A$6","v":""},"volume retain.",{"$f":"C94/$G$6","v":0},0,0,0,0,0,0,0,0,0,0,0,0,0]
[{"$f":"$A$7","v":""},"volume retain.",{"$f":"C95/$G$7","v":0},0,0,0,0,0,0,0,0,0,0,0,0,0]
[{"$f":"$A$8","v":""},"volume retain.",{"$f":"C96/$G$8","v":0},0,0,0,0,0,0,0,0,0,0,0,0,0]
[{"$f":"$A$9","v":""},"volume retain.",{"$f":"C97/$G$9","v":0},0,0,0,0,0,0,0,0,0,0,0,0,0]
[{"$f":"$A$10","v":""},"volume retain.",{"$f":"C98/$G$10","v":0},0,0,0,0,0,0,0,0,0,0,0,0,0]
[{"$f":"$A$11","v":""},"volume retain.",{"$f":"C99/$G$11","v":0},0,0,0,0,0,0,0,0,0,0,0,0,0]
[{"$f":"$A$12","v":""},"volume retain.",{"$f":"C100/$G$12","v":0},0,0,0,0,0,0,0,0,0,0,0,0,0]
[{"$f":"$A$13","v":""},"volume retain.",{"$f":"C101/$G$13","v":0},0,0,0,0,0,0,0,0,0,0,0,0,0]
[{"$f":"$A$14","v":""},"volume retain.",{"$f":"C102/$F$14","v":0},0,0,0,0,0,0,0,0,0,0,0,0,0]
[{"$f":"$A$15","v":""},"volume retain.",{"$f":"C103/$F$15","v":0},0,0,0,0,0,0,0,0,0,0,0,0,0]
[{"$f":"$A$16","v":""},"volume retain.",{"$f":"C104/$F$16","v":0},0,0,0,0,0,0,0,0,0,0,0,0,0]
[{"$f":"$A$17","v":""},"volume retain.",{"$f":"C105/$F$17","v":0},0,0,0,0,0,0,0,0,0,0,0,0,0]
[{"$f":"$A$18","v":""},"volume retain.",{"$f":"C106/$F$18","v":0},0,0,0,0,0,0,0,0,0,0,0,0,0]
[{"$f":"$A$19","v":""},"volume retain.",{"$f":"C107/$F$19","v":0},0,0,0,0,0,0,0,0,0,0,0,0,0]
["Individual ","Vol. Retained",{"$f":"SUM(C$113:C$128)","v":0},0,0,0,0,0,0,0,0,0,0,0,0,0]

{"sheet":"Batching","index":6,"n_rows":61,"n_cols":14,"rows_kept":61,"cut":false,"hidden":false,"merged":[[2,7,2,10],[4,7,4,10],[6,8,6,10],[2,1,2,3],[4,1,4,3],[6,1,6,3],[16,3,16,4],[17,3,17,4],[18,3,18,4],[20,1,20,2],[15,1,15,2],[16,1,16,2],[17,1,17,2],[18,1,18,2],[19,1,19,2],[19,3,19,4],[20,3,20,4],[55,3,55,4],[56,3,56,4],[53,1,53,2],[53,3,53,4],[54,3,54,4],[56,1,56,2],[55,1,55,2],[53,5,53,6],[54,5,54,6],[53,12,53,13],[54,12,54,13],[55,12,55,13],[53,9,53,10],[56,12,56,13],[55,5,55,6],[54,9,54,10],[55,9,55,10],[56,9,56,10],[56,5,56,6],[44,1,44,2],[45,1,45,2],[46,1,46,2],[51,12,51,13],[52,12,52,13],[51,1,51,2],[52,1,52,2],[51,5,51,6],[52,5,52,6],[51,3,51,4],[52,3,52,4],[51,9,51,10],[52,9,52,10],[20,6,20,8],[21,6,21,8],[22,6,22,8],[23,6,23,8],[21,1,21,2],[22,1,22,2],[23,1,23,2],[21,3,21,4],[22,3,22,4],[23,3,23,4],[10,3,10,6],[54,1,54,2],[13,6,13,8],[12,3,12,4],[13,3,13,4],[14,6,14,8],[15,6,15,8],[16,6,16,8],[17,6,17,8],[18,6,18,8],[19,6,19,8],[14,3,14,4],[15,3,15,4],[12,1,12,2],[13,1,13,2],[14,1,14,2]]}
[null,null,null,null,"SPECIMEN WEIGHUP"]
[]
["PROJECT #:",{"$f":"Initial_Info1!C4","v":0},null,null,null,"CONTRACTOR:",null,{"$f":"Initial_Info1!C3","v":0}]
[]
["DATE:",{"$f":"TODAY()","v":"2018-08-31"},null,null,null,"MIXTURE TYPE:",null,{"$f":"Initial_Info1!C7&Initial_Info1!D7","v":""}]
[]
["DESIGN METHODOLOGY:",{"$f":"IF(OR(LEFT(H5,2)=\"SL\",LEFT(H5,1)=\"B\"),\"BIT. PAV'T.\",IF(LEFT(H5,2)=\"UB\",\"Gyratory\", IF(LEFT(H5,2)=\"SP\",\"SUPERPAVE\",\"Non-MoDOT\")))","v":"Non-MoDOT"},null,null,null,"TYPE OF SPECIMEN TO WEIGHUP:",null,null,{"$f":"Initial_Info1!F7","v":"Gyratory"}]
[]
["SPECIMEN WEIGHT:",4700,"Aggregate",{"$f":"ROUND(B9*(100-A53)/100,0)","v":4446},"(grams)"]
[]
[null,null,null,"AGGREGATE INFORMATION"]
[]
["MATERIAL ID","AGGREGATE",null,"AGGREGATE",null,"BIN","WEIGHT",10000,"gram"]
[null,"SOURCE",null,"GRADING",null,"%","(per bucket)"]
[{"$f":"Blending!A4","v":""},{"$f":"Blending!B4","v":0},null,{"$f":"Blending!D4","v":0},null,{"$f":"Blending!E4","v":0},{"$f":"F15/(100-SUM($L$54:$L$57)-SUM($D$45:$D$47))*$H$13","v":0}]
[{"$f":"Blending!A5","v":""},{"$f":"Blending!B5","v":0},null,{"$f":"Blending!D5","v":0},null,{"$f":"Blending!E5","v":0},{"$f":"F16/(100-SUM($L$54:$L$57)-SUM($D$45:$D$47))*$H$13","v":0}]
[{"$f":"Blending!A6","v":""},{"$f":"Blending!B6","v":0},null,{"$f":"Blending!D6","v":0},null,{"$f":"Blending!E6","v":0},0]
[{"$f":"Blending!A7","v":""},{"$f":"Blending!B7","v":0},null,{"$f":"Blending!D7","v":0},null,{"$f":"Blending!E7","v":0},0]
[{"$f":"Blending!A8","v":""},{"$f":"Blending!B8","v":0},null,{"$f":"Blending!D8","v":0},null,{"$f":"Blending!E8","v":0},0]
[{"$f":"Blending!A9","v":""},{"$f":"Blending!B9","v":0},null,{"$f":"Blending!D9","v":0},null,{"$f":"Blending!E9","v":0},0]
[{"$f":"Blending!A10","v":""},{"$f":"Blending!B10","v":0},null,{"$f":"Blending!D10","v":0},null,{"$f":"Blending!E10","v":0},0]
[{"$f":"Blending!A11","v":""},{"$f":"Blending!B11","v":0},null,{"$f":"Blending!D11","v":0},null,{"$f":"Blending!E11","v":0},0]
[{"$f":"Blending!A12","v":""},{"$f":"Blending!B12","v":0},null,{"$f":"Blending!D12","v":0},null,{"$f":"Blending!E12","v":0},0]
[{"$f":"Blending!A13","v":""},{"$f":"Blending!B13","v":0},null,{"$f":"Blending!D13","v":0},null,{"$f":"Blending!E13","v":0},0]
[]
[null,"WEIGHUP",3,"SPECIMENS",null,null,"TOTAL=",{"$f":"SUM(G15:G24)","v":0},"(grams)"]
[]
[]
["SIEVE","SIZE","JMF","%","INDIVIDUAL WEIGHT",null,"CUMULATIVE WEIGHT",null,"SIEVE","SIZE","   MAKE SPECIMENS"]
["ENGLISH","(mm)",null,"RETAINED","       RETAINED",null,"          RETAINED",null,"ENGLISH","(mm)","   USING THE FOLLOWING:"]
["2\"",50,{"$f":"MO_JMF_Std!T25","v":0},{"$f":"(100-C31)","v":100},null,{"$f":"($D$9-SUM($M$54:$M$57,$F$45:$F$47)+$D$53)*D31/100","v":4446},null,{"$f":"F31","v":4446},"2\"",50,"MARSHALL BLOWS:",null,{"$f":"IF(I7=\"Marshall\",Initial_Info1!E7,\"\")","v":""}]
["1 1/2\"",37.5,{"$f":"MO_JMF_Std!T26","v":0},{"$f":"(C31-C32)","v":0},null,{"$f":"($D$9-SUM($M$54:$M$57,$F$45:$F$47)+$D$53)*D32/100","v":0},null,{"$f":"F32+H31","v":4446},"1 1/2\"",37.5,"HAND/MECHANICAL:"]
["1\"",25,{"$f":"MO_JMF_Std!T27","v":0},0,null,0,null,4446,"1\"",25,"GYRATORY EFFORT:"]
["3/4\"",19,{"$f":"MO_JMF_Std!T28","v":0},0,null,0,null,4446,"3/4\"",19,"N(initial)=",null,{"$f":"IF($I$7=\"Gyratory\",Initial_Info1!E6,\"\")","v":""}]
["1/2\"",12.5,{"$f":"MO_JMF_Std!T29","v":0},0,null,0,null,4446,"1/2\"",12.5,"N(design)=",null,{"$f":"IF($I$7=\"Gyratory\",Initial_Info1!E7,\"\")","v":{"$error":"#N/A"}}]
["3/8\"",9.5,{"$f":"MO_JMF_Std!T30","v":0},0,null,0,null,4446,"3/8\"",9.5,"N(maximum)=",null,{"$f":"IF($I$7=\"Gyratory\",Initial_Info1!E8,\"\")","v":""}]
["#4",4.75,{"$f":"MO_JMF_Std!T31","v":0},0,null,0,null,4446,"#4",4.75,"AC GRADE:",null,{"$f":"Initial_Info1!E12","v":"PG 64-22 Gr. H"}]
["#8",2.36,{"$f":"MO_JMF_Std!T32","v":0},0,null,0,null,4446,"#8",2.36,"MIXING TEMP.:",null,{"$f":"Initial_Info1!E13","v":0}]
["#16",1.18,{"$f":"MO_JMF_Std!T33","v":0},0,null,0,null,4446,"#16",1.18,"OVEN CURE TIME:",null,"2 hrs."]
["#30",0.6,{"$f":"MO_JMF_Std!T34","v":0},0,null,0,null,4446,"#30",0.6,"OVEN CURE TEMP.:",null,{"$f":"Initial_Info1!E14","v":0}]
["#50",0.3,{"$f":"MO_JMF_Std!T35","v":0},0,null,0,null,4446,"#50",0.3,"Person who:"]
["#100",0.15,{"$f":"MO_JMF_Std!T36","v":0},0,null,0,null,4446,"#100",0.15,"-Mixed and compacted:"]
["#200",7.4999999999999997E-2,{"$f":"MO_JMF_Std!T37","v":0},0,null,0,null,4446,"#200",7.4999999999999997E-2,"----TRIALS:"]
["PAN","",0,0,null,0,null,4446,"PAN","","----ACTUAL DESIGN:"]
[{"$f":"Blending!A18","v":""},{"$f":"Blending!B18","v":"INNOPHOS, INC., CRANBURY, NJ"},null,{"$f":"Blending!E18","v":0},null,{"$f":"D45/100*$D$9","v":0},null,{"$f":"F45+H44","v":4446},null,null,"----TSR TRIALS:"]
[{"$f":"Blending!A19","v":""},{"$f":"Blending!B19","v":"INNOPHOS, INC., CRANBURY, NJ"},null,{"$f":"Blending!E19","v":0},null,{"$f":"D46/100*$D$9","v":0},null,{"$f":"F46+H45","v":4446},null,null,"----TSR ACTUALS:"]
[{"$f":"Blending!A20","v":""},{"$f":"Blending!B20","v":"INNOPHOS, INC., CRANBURY, NJ"},null,{"$f":"Blending!E20","v":0},null,0,null,4446,null,null,"-Bulked specimens:"]
[]
[null,null,null,null,{"$f":"MO_JMF_Std!O15&\"  \"&MO_JMF_Std!Q15","v":"  "},null,null,null,null,null,"-Ran max.gravities:"]
[null,null,null,null,{"$f":"MO_JMF_Std!O16&\"  \"&MO_JMF_Std!Q16","v":"  "}]
[null,"ASPHALT CEMENT",null,null,{"$f":"MO_JMF_Std!O17&\"  \"&MO_JMF_Std!Q17","v":"  "},null,null,"Check Wt."]
["%TOTAL DESIGN AC","WEIGHT TOTAL AC",null,"WEIGHT RAP AC",null,"WEIGHT VIRGIN AC",null,null,"MATERIAL ID","RECYCLE",null,"BIN %","WEIGHT PER"]
[5.4,{"$f":"ROUND($D$9/(100-A53)*100-$D$9,0)","v":254},null,{"$f":"SUM(M58:M61)","v":0},null,{"$f":"B53-D53","v":254},null,{"$f":"$H$47+F53+SUM($M$54:$M$57)","v":4700},null,null,null,null,"SPECIMEN"]
[null,{"$f":"ROUND($D$9/(100-A54)*100-$D$9,0)","v":0},null,{"$f":"D53","v":0},null,{"$f":"B54-D54","v":0},null,{"$f":"$H$47+F54+SUM($M$54:$M$57)","v":4446},{"$f":"Blending!A14","v":""},{"$f":"Blending!D14","v":0},null,{"$f":"IF(Blending!E14=\"\",\"\",Blending!E14)","v":""},{"$f":"IFERROR($D$9*L54/100,\"\")","v":""},{"$f":"((F52*J52/100)/((100-M52)/100))","v":{"$error":"#VALUE!"}}]
[null,{"$f":"ROUND($D$9/(100-A55)*100-$D$9,0)","v":0},null,{"$f":"D53","v":0},null,{"$f":"B55-D55","v":0},null,4446,{"$f":"Blending!A15","v":""},{"$f":"Blending!D15","v":0},null,{"$f":"IF(Blending!E15=\"\",\"\",Blending!E15)","v":""},{"$f":"IFERROR($D$9*L55/100/((100-Initial_Info1!F43)/100),\"\")","v":""},{"$f":"((F53*J53/100)/((100-M53)/100))","v":{"$error":"#VALUE!"}}]
[null,0,null,{"$f":"D53","v":0},null,{"$f":"B56-D56","v":0},null,4446,{"$f":"Blending!A16","v":""},{"$f":"Blending!D16","v":0},null,{"$f":"IF(Blending!E16=\"\",\"\",Blending!E16)","v":""},{"$f":"IFERROR($D$9*L56/100/((100-Initial_Info1!F44)/100),\"\")","v":""},{"$f":"((F54*J54/100)/((100-M54)/100))","v":{"$error":"#VALUE!"}}]
[null,0,null,{"$f":"D53","v":0},null,{"$f":"B57-D57","v":0},null,4446,{"$f":"Blending!A17","v":""},{"$f":"Blending!D17","v":0},null,{"$f":"IF(Blending!E17=\"\",\"\",Blending!E17)","v":""},{"$f":"IFERROR($D$9*L57/100/((100-Initial_Info1!F45)/100),\"\")","v":""},{"$f":"((F55*J55/100)/((100-M55)/100))","v":{"$error":"#VALUE!"}}]
[null,null,null,null,null,null,null,null,null,null,null,null,{"$f":"IFERROR(ROUND(M54*Initial_Info1!F42/100,0),0)","v":0}]
[null,null,null,null,null,null,null,null,null,null,null,null,{"$f":"IFERROR(ROUND(M55*Initial_Info1!F43/100,0),0)","v":0}]
[null,null,null,null,null,null,null,null,null,null,null,null,{"$f":"IFERROR(ROUND(M56*Initial_Info1!F44/100,0),0)","v":0}]
[null,null,null,null,null,null,null,null,null,null,null,null,{"$f":"IFERROR(ROUND(M57*Initial_Info1!F45/100,0),0)","v":0}]

{"sheet":"Cost_Analysis","index":7,"n_rows":33,"n_cols":14,"rows_kept":33,"cut":false,"hidden":false,"merged":[[23,1,23,2],[24,1,24,2],[3,1,3,2],[4,1,4,2]]}
[null,"MIXTURE COST ANALYSIS"]
[null,null,null,null,null,{"$f":"Initial_Info1!F2","v":0}]
[]
["AGG.","AGGREGATE",null,"AGGREGATE","COLD FEED","COMPONENT"]
["ID.","SOURCE",null,"GRADING","%","COST"]
[{"$f":"IF(Initial_Info1!B28=\"\",\"\",Initial_Info1!B28)","v":""},{"$f":"IF(Initial_Info1!C28=\"\",\"\",Initial_Info1!C28)","v":0},null,{"$f":"IF(Initial_Info1!I28=\"\",\"\",Initial_Info1!I28)","v":0},{"$f":"Blending!E4","v":0},{"$f":"IFERROR(IF(OR(IFERROR(MATCH(TRUE,(AgPlant=$F$2),0)=0,FALSE),ISNA(MATCH(1,(AgMID=$A6)*(AgPlant=$F$2),0))),INDEX(Aggs,MATCH(TRUE,(AgMID=$A6),0),29),INDEX(Aggs,MATCH(1,(AgMID=$A6)*(AgPlant=$F$2),0),29)),0)","v":0}]
[{"$f":"IF(Initial_Info1!B29=\"\",\"\",Initial_Info1!B29)","v":""},{"$f":"IF(Initial_Info1!C29=\"\",\"\",Initial_Info1!C29)","v":0},null,{"$f":"IF(Initial_Info1!I29=\"\",\"\",Initial_Info1!I29)","v":0},{"$f":"Blending!E5","v":0},{"$f":"IFERROR(IF(OR(IFERROR(MATCH(TRUE,(AgPlant=$F$2),0)=0,FALSE),ISNA(MATCH(1,(AgMID=$A7)*(AgPlant=$F$2),0))),INDEX(Aggs,MATCH(TRUE,(AgMID=$A7),0),29),INDEX(Aggs,MATCH(1,(AgMID=$A7)*(AgPlant=$F$2),0),29)),0)","v":0}]
[{"$f":"IF(Initial_Info1!B30=\"\",\"\",Initial_Info1!B30)","v":""},{"$f":"IF(Initial_Info1!C30=\"\",\"\",Initial_Info1!C30)","v":0},null,{"$f":"IF(Initial_Info1!I30=\"\",\"\",Initial_Info1!I30)","v":0},{"$f":"Blending!E6","v":0},{"$f":"IFERROR(IF(OR(IFERROR(MATCH(TRUE,(AgPlant=$F$2),0)=0,FALSE),ISNA(MATCH(1,(AgMID=$A8)*(AgPlant=$F$2),0))),INDEX(Aggs,MATCH(TRUE,(AgMID=$A8),0),29),INDEX(Aggs,MATCH(1,(AgMID=$A8)*(AgPlant=$F$2),0),29)),0)","v":0}]
[{"$f":"IF(Initial_Info1!B31=\"\",\"\",Initial_Info1!B31)","v":""},{"$f":"IF(Initial_Info1!C31=\"\",\"\",Initial_Info1!C31)","v":0},null,{"$f":"IF(Initial_Info1!I31=\"\",\"\",Initial_Info1!I31)","v":0},{"$f":"Blending!E7","v":0},{"$f":"IFERROR(IF(OR(IFERROR(MATCH(TRUE,(AgPlant=$F$2),0)=0,FALSE),ISNA(MATCH(1,(AgMID=$A9)*(AgPlant=$F$2),0))),INDEX(Aggs,MATCH(TRUE,(AgMID=$A9),0),29),INDEX(Aggs,MATCH(1,(AgMID=$A9)*(AgPlant=$F$2),0),29)),0)","v":0}]
[{"$f":"IF(Initial_Info1!B32=\"\",\"\",Initial_Info1!B32)","v":""},{"$f":"IF(Initial_Info1!C32=\"\",\"\",Initial_Info1!C32)","v":0},null,{"$f":"IF(Initial_Info1!I32=\"\",\"\",Initial_Info1!I32)","v":0},{"$f":"Blending!E8","v":0},{"$f":"IFERROR(IF(OR(IFERROR(MATCH(TRUE,(AgPlant=$F$2),0)=0,FALSE),ISNA(MATCH(1,(AgMID=$A10)*(AgPlant=$F$2),0))),INDEX(Aggs,MATCH(TRUE,(AgMID=$A10),0),29),INDEX(Aggs,MATCH(1,(AgMID=$A10)*(AgPlant=$F$2),0),29)),0)","v":0}]
[{"$f":"IF(Initial_Info1!B35=\"\",\"\",Initial_Info1!B35)","v":""},{"$f":"IF(Initial_Info1!C35=\"\",\"\",Initial_Info1!C35)","v":0},null,{"$f":"IF(Initial_Info1!I35=\"\",\"\",Initial_Info1!I35)","v":0},{"$f":"Blending!E9","v":0},{"$f":"IFERROR(IF(OR(IFERROR(MATCH(TRUE,(AgPlant=$F$2),0)=0,FALSE),ISNA(MATCH(1,(AgMID=$A11)*(AgPlant=$F$2),0))),INDEX(Aggs,MATCH(TRUE,(AgMID=$A11),0),29),INDEX(Aggs,MATCH(1,(AgMID=$A11)*(AgPlant=$F$2),0),29)),0)","v":0}]
[{"$f":"IF(Initial_Info1!B36=\"\",\"\",Initial_Info1!B36)","v":""},{"$f":"IF(Initial_Info1!C36=\"\",\"\",Initial_Info1!C36)","v":0},null,{"$f":"IF(Initial_Info1!I36=\"\",\"\",Initial_Info1!I36)","v":0},{"$f":"Blending!E10","v":0},{"$f":"IFERROR(IF(OR(IFERROR(MATCH(TRUE,(AgPlant=$F$2),0)=0,FALSE),ISNA(MATCH(1,(AgMID=$A12)*(AgPlant=$F$2),0))),INDEX(Aggs,MATCH(TRUE,(AgMID=$A12),0),29),INDEX(Aggs,MATCH(1,(AgMID=$A12)*(AgPlant=$F$2),0),29)),0)","v":0}]
[{"$f":"IF(Initial_Info1!B37=\"\",\"\",Initial_Info1!B37)","v":""},{"$f":"IF(Initial_Info1!C37=\"\",\"\",Initial_Info1!C37)","v":0},null,{"$f":"IF(Initial_Info1!I37=\"\",\"\",Initial_Info1!I37)","v":0},{"$f":"Blending!E11","v":0},{"$f":"IFERROR(IF(OR(IFERROR(MATCH(TRUE,(AgPlant=$F$2),0)=0,FALSE),ISNA(MATCH(1,(AgMID=$A13)*(AgPlant=$F$2),0))),INDEX(Aggs,MATCH(TRUE,(AgMID=$A13),0),29),INDEX(Aggs,MATCH(1,(AgMID=$A13)*(AgPlant=$F$2),0),29)),0)","v":0}]
[{"$f":"IF(Initial_Info1!B38=\"\",\"\",Initial_Info1!B38)","v":""},{"$f":"IF(Initial_Info1!C38=\"\",\"\",Initial_Info1!C38)","v":0},null,{"$f":"IF(Initial_Info1!I38=\"\",\"\",Initial_Info1!I38)","v":0},{"$f":"Blending!E12","v":0},{"$f":"IFERROR(IF(OR(IFERROR(MATCH(TRUE,(AgPlant=$F$2),0)=0,FALSE),ISNA(MATCH(1,(AgMID=$A14)*(AgPlant=$F$2),0))),INDEX(Aggs,MATCH(TRUE,(AgMID=$A14),0),29),INDEX(Aggs,MATCH(1,(AgMID=$A14)*(AgPlant=$F$2),0),29)),0)","v":0}]
[{"$f":"IF(Initial_Info1!B39=\"\",\"\",Initial_Info1!B39)","v":""},{"$f":"IF(Initial_Info1!C39=\"\",\"\",Initial_Info1!C39)","v":0},null,{"$f":"IF(Initial_Info1!I39=\"\",\"\",Initial_Info1!I39)","v":0},{"$f":"Blending!E13","v":0},{"$f":"IFERROR(IF(OR(IFERROR(MATCH(TRUE,(AgPlant=$F$2),0)=0,FALSE),ISNA(MATCH(1,(AgMID=$A15)*(AgPlant=$F$2),0))),INDEX(Aggs,MATCH(TRUE,(AgMID=$A15),0),29),INDEX(Aggs,MATCH(1,(AgMID=$A15)*(AgPlant=$F$2),0),29)),0)","v":0}]
[{"$f":"IF(Initial_Info1!B42=\"\",\"\",Initial_Info1!B42)","v":""},{"$f":"IF(Initial_Info1!C42=\"\",\"\",Initial_Info1!C42)","v":0},null,{"$f":"IF(Initial_Info1!E42=\"\",\"\",Initial_Info1!E42)","v":0},{"$f":"Blending!E14","v":0},{"$f":"IFERROR(IF(OR(IFERROR(MATCH(TRUE,(AgPlant=$F$2),0)=0,FALSE),ISNA(MATCH(1,(AgMID=$A16)*(AgPlant=$F$2),0))),INDEX(Aggs,MATCH(TRUE,(AgMID=$A16),0),29),INDEX(Aggs,MATCH(1,(AgMID=$A16)*(AgPlant=$F$2),0),29)),0)","v":0}]
[{"$f":"IF(Initial_Info1!B43=\"\",\"\",Initial_Info1!B43)","v":""},{"$f":"IF(Initial_Info1!C43=\"\",\"\",Initial_Info1!C43)","v":0},null,{"$f":"IF(Initial_Info1!E43=\"\",\"\",Initial_Info1!E43)","v":0},{"$f":"Blending!E15","v":0},{"$f":"IFERROR(IF(OR(IFERROR(MATCH(TRUE,(AgPlant=$F$2),0)=0,FALSE),ISNA(MATCH(1,(AgMID=$A17)*(AgPlant=$F$2),0))),INDEX(Aggs,MATCH(TRUE,(AgMID=$A17),0),29),INDEX(Aggs,MATCH(1,(AgMID=$A17)*(AgPlant=$F$2),0),29)),0)","v":0}]
[{"$f":"IF(Initial_Info1!B44=\"\",\"\",Initial_Info1!B44)","v":""},{"$f":"IF(Initial_Info1!C44=\"\",\"\",Initial_Info1!C44)","v":0},null,{"$f":"IF(Initial_Info1!E44=\"\",\"\",Initial_Info1!E44)","v":0},{"$f":"Blending!E16","v":0},{"$f":"IFERROR(IF(OR(IFERROR(MATCH(TRUE,(AgPlant=$F$2),0)=0,FALSE),ISNA(MATCH(1,(AgMID=$A18)*(AgPlant=$F$2),0))),INDEX(Aggs,MATCH(TRUE,(AgMID=$A18),0),29),INDEX(Aggs,MATCH(1,(AgMID=$A18)*(AgPlant=$F$2),0),29)),0)","v":0}]
[{"$f":"IF(Initial_Info1!B45=\"\",\"\",Initial_Info1!B45)","v":""},{"$f":"IF(Initial_Info1!C45=\"\",\"\",Initial_Info1!C45)","v":0},null,{"$f":"IF(Initial_Info1!E45=\"\",\"\",Initial_Info1!E45)","v":0},{"$f":"Blending!E17","v":0},{"$f":"IFERROR(IF(OR(IFERROR(MATCH(TRUE,(AgPlant=$F$2),0)=0,FALSE),ISNA(MATCH(1,(AgMID=$A19)*(AgPlant=$F$2),0))),INDEX(Aggs,MATCH(TRUE,(AgMID=$A19),0),29),INDEX(Aggs,MATCH(1,(AgMID=$A19)*(AgPlant=$F$2),0),29)),0)","v":0}]
[{"$f":"IF(Initial_Info1!B48=\"\",\"\",Initial_Info1!B48)","v":""},{"$f":"IF(Initial_Info1!C48=\"\",\"\",Initial_Info1!C48)","v":"INNOPHOS, INC."},null,{"$f":"IF(Initial_Info1!E48=\"\",\"\",Initial_Info1!E48)","v":"Anti-Strip"},{"$f":"IF(LEFT(Initial_Info1!F48,1)=\"Y\",0,Blending!E18)","v":0},{"$f":"IFERROR(IF(OR(IFERROR(MATCH(TRUE,(AdPlant=$F$2),0)=0,FALSE),ISNA(MATCH(1,(AdMID=$A20)*(AdPlant=$F$2),0))),INDEX(Addtv,MATCH(TRUE,(AdMID=$A20),0),25),INDEX(Addtv,MATCH(1,(AdMID=$A20)*(AdPlant=$F$2),0),25)),0)","v":0}]
[{"$f":"IF(Initial_Info1!B49=\"\",\"\",Initial_Info1!B49)","v":""},{"$f":"IF(Initial_Info1!C49=\"\",\"\",Initial_Info1!C49)","v":"INNOPHOS, INC."},null,{"$f":"IF(Initial_Info1!E49=\"\",\"\",Initial_Info1!E49)","v":"Anti-Strip"},{"$f":"IF(LEFT(Initial_Info1!F49,1)=\"Y\",0,Blending!E19)","v":0},{"$f":"IFERROR(IF(OR(IFERROR(MATCH(TRUE,(AdPlant=$F$2),0)=0,FALSE),ISNA(MATCH(1,(AdMID=$A21)*(AdPlant=$F$2),0))),INDEX(Addtv,MATCH(TRUE,(AdMID=$A21),0),25),INDEX(Addtv,MATCH(1,(AdMID=$A21)*(AdPlant=$F$2),0),25)),0)","v":0}]
[null,null,null,null,null,{"$f":"SUM(E6:E21*F6:F21)/SUM(E6:E21)","v":{"$error":"#DIV/0!"}}]
[]
["MAT'L.","MATERIAL",null,"ADDED BY ","MATERIAL","COMPONENT","COMPONENT","COMPONENT"]
["ID.","SOURCE",null,"WEIGHT OF","% WT. of MIX","PER TON COST","COST","UNIT"]
[{"$f":"IF(Initial_Info1!B17=\"\",\"\",Initial_Info1!B17)","v":""},{"$f":"IF(Initial_Info1!C17=\"\",\"\",Initial_Info1!C17)","v":"INNOPHOS, INC."},null,{"$f":"IF(Initial_Info1!G17=\"\",\"\",Initial_Info1!G17)","v":"Binder"},{"$f":"IF(Initial_Info1!H17=\"\",\"\",Initial_Info1!H17)","v":""},{"$f":"IFERROR(ROUND(E26/100*G26*VLOOKUP(H26,$J$27:$N$29,MATCH(D26,$K$26:$N$26,0)+1,FALSE),2),\"\")","v":""},{"$f":"IFERROR(IF(OR(IFERROR(MATCH(TRUE,(AdPlant=$F$2),0)=0,FALSE),ISNA(MATCH(1,(AdMID=$A26)*(AdPlant=$F$2),0))),INDEX(Addtv,MATCH(TRUE,(AdMID=$A26),0),23),INDEX(Addtv,MATCH(1,(AdMID=$A26)*(AdPlant=$F$2),0),23)),\"\")","v":0},{"$f":"IF(OR(MATCH(TRUE,(AdPlant=$F$2),0)=0,ISNA(MATCH(1,(AdMID=$A26)*(AdPlant=$F$2),0))),INDEX(Addtv,MATCH(TRUE,(AdMID=$A26),0),24),INDEX(Addtv,MATCH(1,(AdMID=$A26)*(AdPlant=$F$2),0),24))","v":"Lbs"},null,null,"Binder","Recycle","GTR","Mixture"]
[{"$f":"IF(Initial_Info1!B18=\"\",\"\",Initial_Info1!B18)","v":""},{"$f":"IF(Initial_Info1!C18=\"\",\"\",Initial_Info1!C18)","v":"INNOPHOS, INC."},null,{"$f":"IF(Initial_Info1!G18=\"\",\"\",Initial_Info1!G18)","v":"Binder"},{"$f":"IF(Initial_Info1!H18=\"\",\"\",Initial_Info1!H18)","v":""},{"$f":"IFERROR(ROUND(E27/100*G27*VLOOKUP(H27,$J$27:$N$29,MATCH(D27,$K$26:$N$26,0)+1,FALSE),2),\"\")","v":""},{"$f":"IFERROR(IF(OR(IFERROR(MATCH(TRUE,(AdPlant=$F$2),0)=0,FALSE),ISNA(MATCH(1,(AdMID=$A27)*(AdPlant=$F$2),0))),INDEX(Addtv,MATCH(TRUE,(AdMID=$A27),0),23),INDEX(Addtv,MATCH(1,(AdMID=$A27)*(AdPlant=$F$2),0),23)),\"\")","v":0},{"$f":"IF(OR(MATCH(TRUE,(AdPlant=$F$2),0)=0,ISNA(MATCH(1,(AdMID=$A27)*(AdPlant=$F$2),0))),INDEX(Addtv,MATCH(TRUE,(AdMID=$A27),0),24),INDEX(Addtv,MATCH(1,(AdMID=$A27)*(AdPlant=$F$2),0),24))","v":"Lbs"},null,"Lbs",{"$f":"E32/100*2000","v":108.00000000000001},{"$f":"SUM(E16:E19)/(100+$E$32)*2000","v":0},{"$f":"IFERROR(VLOOKUP(\"GTR\",Initial_Info1!F17:H21,3,FALSE)/100*E32/100*2000,0)","v":0},2000]
[{"$f":"IF(Initial_Info1!B19=\"\",\"\",Initial_Info1!B19)","v":""},{"$f":"IF(Initial_Info1!C19=\"\",\"\",Initial_Info1!C19)","v":"INNOPHOS, INC."},null,{"$f":"IF(Initial_Info1!G19=\"\",\"\",Initial_Info1!G19)","v":"Binder"},{"$f":"IF(Initial_Info1!H19=\"\",\"\",Initial_Info1!H19)","v":""},"",{"$f":"IFERROR(IF(OR(IFERROR(MATCH(TRUE,(AdPlant=$F$2),0)=0,FALSE),ISNA(MATCH(1,(AdMID=$A28)*(AdPlant=$F$2),0))),INDEX(Addtv,MATCH(TRUE,(AdMID=$A28),0),23),INDEX(Addtv,MATCH(1,(AdMID=$A28)*(AdPlant=$F$2),0),23)),\"\")","v":0},{"$f":"IF(OR(MATCH(TRUE,(AdPlant=$F$2),0)=0,ISNA(MATCH(1,(AdMID=$A28)*(AdPlant=$F$2),0))),INDEX(Addtv,MATCH(TRUE,(AdMID=$A28),0),24),INDEX(Addtv,MATCH(1,(AdMID=$A28)*(AdPlant=$F$2),0),24))","v":"Lbs"},null,"Tons",{"$f":"E32/100","v":5.4000000000000006E-2},{"$f":"SUM(E16:E19)/(100+$E$32)","v":0},{"$f":"IFERROR(VLOOKUP(\"GTR\",Initial_Info1!F17:H21,3,FALSE)/100*E32/100,0)","v":0},1]
[{"$f":"IF(Initial_Info1!B20=\"\",\"\",Initial_Info1!B20)","v":""},{"$f":"IF(Initial_Info1!C20=\"\",\"\",Initial_Info1!C20)","v":"INNOPHOS, INC."},null,{"$f":"IF(Initial_Info1!G20=\"\",\"\",Initial_Info1!G20)","v":"Binder"},{"$f":"IF(Initial_Info1!H20=\"\",\"\",Initial_Info1!H20)","v":""},"",{"$f":"IFERROR(IF(OR(IFERROR(MATCH(TRUE,(AdPlant=$F$2),0)=0,FALSE),ISNA(MATCH(1,(AdMID=$A29)*(AdPlant=$F$2),0))),INDEX(Addtv,MATCH(TRUE,(AdMID=$A29),0),23),INDEX(Addtv,MATCH(1,(AdMID=$A29)*(AdPlant=$F$2),0),23)),\"\")","v":0},{"$f":"IF(OR(MATCH(TRUE,(AdPlant=$F$2),0)=0,ISNA(MATCH(1,(AdMID=$A29)*(AdPlant=$F$2),0))),INDEX(Addtv,MATCH(TRUE,(AdMID=$A29),0),24),INDEX(Addtv,MATCH(1,(AdMID=$A29)*(AdPlant=$F$2),0),24))","v":"Lbs"},null,"Gal",{"$f":"E32/100/8.35*2000","v":12.934131736526949},{"$f":"SUM(E16:E19)/(100+E32)/8.35*2000","v":0},{"$f":"IFERROR(VLOOKUP(\"GTR\",Initial_Info1!F17:H21,3,FALSE)/100*E32/100/8.35*2000,0)","v":0},{"$f":"1/8.35*2000","v":239.52095808383234}]
[{"$f":"IF(Initial_Info1!B21=\"\",\"\",Initial_Info1!B21)","v":""},{"$f":"IF(Initial_Info1!C21=\"\",\"\",Initial_Info1!C21)","v":"INNOPHOS, INC."},null,{"$f":"IF(Initial_Info1!G21=\"\",\"\",Initial_Info1!G21)","v":"Binder"},{"$f":"IF(Initial_Info1!H21=\"\",\"\",Initial_Info1!H21)","v":""},"",{"$f":"IFERROR(IF(OR(IFERROR(MATCH(TRUE,(AdPlant=$F$2),0)=0,FALSE),ISNA(MATCH(1,(AdMID=$A30)*(AdPlant=$F$2),0))),INDEX(Addtv,MATCH(TRUE,(AdMID=$A30),0),23),INDEX(Addtv,MATCH(1,(AdMID=$A30)*(AdPlant=$F$2),0),23)),\"\")","v":0},{"$f":"IF(OR(MATCH(TRUE,(AdPlant=$F$2),0)=0,ISNA(MATCH(1,(AdMID=$A30)*(AdPlant=$F$2),0))),INDEX(Addtv,MATCH(TRUE,(AdMID=$A30),0),24),INDEX(Addtv,MATCH(1,(AdMID=$A30)*(AdPlant=$F$2),0),24))","v":"Lbs"}]
[{"$f":"IF(Initial_Info1!B24=\"\",\"\",Initial_Info1!B24)","v":""},{"$f":"IF(Initial_Info1!C24=\"\",\"\",Initial_Info1!C24)","v":"INNOPHOS, INC."},null,{"$f":"IF(Initial_Info1!G24=\"\",\"\",Initial_Info1!G24)","v":"Binder"},{"$f":"IF(Initial_Info1!H24=\"\",\"\",Initial_Info1!H24)","v":""},"",{"$f":"IFERROR(IF(OR(IFERROR(MATCH(TRUE,(AdPlant=$F$2),0)=0,FALSE),ISNA(MATCH(1,(AdMID=$A31)*(AdPlant=$F$2),0))),INDEX(Addtv,MATCH(TRUE,(AdMID=$A31),0),23),INDEX(Addtv,MATCH(1,(AdMID=$A31)*(AdPlant=$F$2),0),23)),\"\")","v":0},{"$f":"IF(OR(MATCH(TRUE,(AdPlant=$F$2),0)=0,ISNA(MATCH(1,(AdMID=$A31)*(AdPlant=$F$2),0))),INDEX(Addtv,MATCH(TRUE,(AdMID=$A31),0),24),INDEX(Addtv,MATCH(1,(AdMID=$A31)*(AdPlant=$F$2),0),24))","v":"Lbs"}]
[{"$f":"IF(Initial_Info1!B12=\"\",\"\",Initial_Info1!B12)","v":""},{"$f":"IF(Initial_Info1!C12=\"\",\"\",Initial_Info1!C12)","v":"HERZOG"},null,"Mixture",{"$f":"IF(MO_JMF_Std!S40=\"\",\"\",MO_JMF_Std!S40)","v":5.4},{"$f":"E32/100*G32","v":0},{"$f":"IFERROR(IF(OR(IFERROR(MATCH(TRUE,(BindPlant=$F$2),0)=0,FALSE),ISNA(MATCH(1,(BindMID=$A$32)*(BindPlant=$F$2),0))),INDEX(Binder,MATCH(TRUE,(BindMID=$A$32),0),9),INDEX(Binder,MATCH(1,(BindMID=$A$32)*(BindPlant=$F$2),0),9)),\"\")","v":0},{"$f":"IF(OR(MATCH(TRUE,(BindPlant=$F$2),0)=0,ISNA(MATCH(1,(BindMID=$A$32)*(BindPlant=$F$2),0))),INDEX(Binder,MATCH(TRUE,(BindMID=$A$32),0),10),INDEX(Binder,MATCH(1,(BindMID=$A$32)*(BindPlant=$F$2),0),10))","v":"Tons"}]
[null,null,null,null,null,{"$f":"SUM(F26:F32)","v":0}]

{"sheet":"MO_JMF_Std","index":8,"n_rows":52,"n_cols":49,"rows_kept":52,"cut":false,"hidden":false,"merged":[[19,14,19,15],[19,17,19,18],[17,16,17,18],[18,14,18,15],[18,16,18,18],[16,14,16,15],[17,14,17,15],[14,14,14,15],[14,16,14,18],[15,16,15,18],[16,16,16,18],[10,16,10,17],[11,16,11,17],[12,16,12,17],[13,14,13,15],[15,14,15,15],[13,16,13,17],[10,14,10,15],[11,14,11,15],[12,14,12,15],[9,16,9,17],[5,14,5,15],[6,14,6,15],[7,14,7,15],[8,14,8,15],[9,14,9,15],[1,9,1,10],[5,16,5,17],[6,16,6,17],[7,16,7,17],[8,16,8,17],[2,9,2,10],[3,9,3,10]]}
[null,null,null,null,null,null,null,null,null,{"$f":"Initial_Info1!C3","v":0}]
[null,null,null,null,null,null,null,null,"MIX TYPE",{"$f":"Initial_Info1!C7&Initial_Info1!D7","v":""},null,null,null,null,null,null,null,null,null,{"$f":"+Q4","v":0}]
[null,null,null,null,null,null,null,null,"COMPACTION",{"$f":"Initial_Info1!F7","v":"Gyratory"},null,null,null,null,null,null,null,null,null,null,null,null,null,null,null,"Material ID","Source, Location","Formation","Ledge(s)","Size","Gsb","Gsa","Abs.","Chert","% Blend","2\"","1 1/2\"","1\"","3/4\"","1/2\"","3/8\"","#4","#8","#16","#30","#50","#100","#200","PI"]
[null,null,null,null,null,null,null,null,"LAB MIXER",{"$f":"Initial_Info1!F4","v":0},null,null,null,null,null,null,null,null,null,null,null,null,null,null,{"$f":"COUNTIF(AI4,\">0\")","v":0},{"$f":"Initial_Info1!B28","v":0},{"$f":"Initial_Info1!C28&\", \"&Initial_Info1!D28&\"        \"&Initial_Info1!G28","v":"0, 0        0"},{"$f":"Initial_Info1!E28","v":0},{"$f":"Initial_Info1!F28","v":0},{"$f":"Initial_Info1!H28","v":0},{"$f":"IFERROR(IF(CoreLokAggSpG!N11=\"\",Blend_AggSpG_PI!P5,CoreLokAggSpG!N11),\"\")","v":""},{"$f":"IFERROR(IF(CoreLokAggSpG!M11=\"\",Blend_AggSpG_PI!O5,CoreLokAggSpG!M11),\"\")","v":""},{"$f":"IFERROR(IF(CoreLokAggSpG!O11=\"\",Blend_AggSpG_PI!Q5,CoreLokAggSpG!O11),\"\")","v":""},{"$f":"Initial_Info1!J28","v":0},{"$f":"Blending!E4","v":0},{"$f":"Initial_Info1!L28","v":0},{"$f":"Initial_Info1!M28","v":0},{"$f":"Initial_Info1!N28","v":0},{"$f":"Initial_Info1!O28","v":0},{"$f":"Initial_Info1!P28","v":0},{"$f":"Initial_Info1!Q28","v":0},{"$f":"Initial_Info1!R28","v":0},{"$f":"Initial_Info1!S28","v":0},{"$f":"Initial_Info1!T28","v":0},{"$f":"Initial_Info1!U28","v":0},{"$f":"Initial_Info1!V28","v":0},{"$f":"Initial_Info1!W28","v":0},{"$f":"Initial_Info1!X28","v":0},{"$f":"IF(Blend_AggSpG_PI!N32=\"\",\"\",IF(Blend_AggSpG_PI!N32=\"Non-Plastic\",\"NP\",Blend_AggSpG_PI!N32))","v":""}]
[null,"IDENT",null,null,null,null,null,null,null,null,null,"BULK","APP.",null,null,null,null,null,null,null,null,null,null,null,{"$f":"COUNTIF(AI4:AI5,\">0\")","v":0},{"$f":"Initial_Info1!B29","v":0},{"$f":"Initial_Info1!C29&\", \"&Initial_Info1!D29&\"        \"&Initial_Info1!G29","v":"0, 0        0"},{"$f":"Initial_Info1!E29","v":0},{"$f":"Initial_Info1!F29","v":0},{"$f":"Initial_Info1!H29","v":0},{"$f":"IFERROR(IF(CoreLokAggSpG!N12=\"\",Blend_AggSpG_PI!P6,CoreLokAggSpG!N12),\"\")","v":""},{"$f":"IFERROR(IF(CoreLokAggSpG!M12=\"\",Blend_AggSpG_PI!O6,CoreLokAggSpG!M12),\"\")","v":""},{"$f":"IFERROR(IF(CoreLokAggSpG!O12=\"\",Blend_AggSpG_PI!Q6,CoreLokAggSpG!O12),\"\")","v":""},{"$f":"Initial_Info1!J29","v":0},{"$f":"Blending!E5","v":0},{"$f":"Initial_Info1!L29","v":0},{"$f":"Initial_Info1!M29","v":0},{"$f":"Initial_Info1!N29","v":0},{"$f":"Initial_Info1!O29","v":0},{"$f":"Initial_Info1!P29","v":0},{"$f":"Initial_Info1!Q29","v":0},{"$f":"Initial_Info1!R29","v":0},{"$f":"Initial_Info1!S29","v":0},{"$f":"Initial_Info1!T29","v":0},{"$f":"Initial_Info1!U29","v":0},{"$f":"Initial_Info1!V29","v":0},{"$f":"Initial_Info1!W29","v":0},{"$f":"Initial_Info1!X29","v":0},{"$f":"IF(Blend_AggSpG_PI!N34=\"\",\"\",IF(Blend_AggSpG_PI!N34=\"Non-Plastic\",\"NP\",Blend_AggSpG_PI!N34))","v":""}]
[null,"NO.",null,"PRODUCER-LOCATION",null,null,null,null,null,null,"PI","SP. GR.","SP. GR.","%ABS","FORMATION",null,"LEDGES",null,"% CHERT",null,null,null,null,null,{"$f":"COUNTIF(AI4:AI6,\">0\")","v":0},{"$f":"Initial_Info1!B30","v":0},{"$f":"Initial_Info1!C30&\", \"&Initial_Info1!D30&\"        \"&Initial_Info1!G30","v":"0, 0        0"},{"$f":"Initial_Info1!E30","v":0},{"$f":"Initial_Info1!F30","v":0},{"$f":"Initial_Info1!H30","v":0},{"$f":"IFERROR(IF(CoreLokAggSpG!N13=\"\",Blend_AggSpG_PI!P7,CoreLokAggSpG!N13),\"\")","v":""},{"$f":"IFERROR(IF(CoreLokAggSpG!M13=\"\",Blend_AggSpG_PI!O7,CoreLokAggSpG!M13),\"\")","v":""},{"$f":"IFERROR(IF(CoreLokAggSpG!O13=\"\",Blend_AggSpG_PI!Q7,CoreLokAggSpG!O13),\"\")","v":""},{"$f":"Initial_Info1!J30","v":0},{"$f":"Blending!E6","v":0},{"$f":"Initial_Info1!L30","v":0},{"$f":"Initial_Info1!M30","v":0},{"$f":"Initial_Info1!N30","v":0},{"$f":"Initial_Info1!O30","v":0},{"$f":"Initial_Info1!P30","v":0},{"$f":"Initial_Info1!Q30","v":0},{"$f":"Initial_Info1!R30","v":0},{"$f":"Initial_Info1!S30","v":0},{"$f":"Initial_Info1!T30","v":0},{"$f":"Initial_Info1!U30","v":0},{"$f":"Initial_Info1!V30","v":0},{"$f":"Initial_Info1!W30","v":0},{"$f":"Initial_Info1!X30","v":0},{"$f":"IF(Blend_AggSpG_PI!N36=\"\",\"\",IF(Blend_AggSpG_PI!N36=\"Non-Plastic\",\"NP\",Blend_AggSpG_PI!N36))","v":""}]
[null,{"$f":"IFERROR(VLOOKUP(1,$Y$4:$AV$19,2,FALSE),\"\")","v":""},{"$f":"IFERROR(VLOOKUP(1,$Y$4:$AV$19,6,FALSE),\"\")","v":""},{"$f":"IFERROR(VLOOKUP(1,$Y$4:$AV$19,3,FALSE),\"\")","v":""},null,null,null,null,null,null,{"$f":"IFERROR(VLOOKUP(1,$Y$4:$AW$25,25,FALSE),\"\")","v":""},{"$f":"IFERROR(VLOOKUP(1,$Y$4:$AV$19,7,FALSE),\"\")","v":""},{"$f":"IFERROR(VLOOKUP(1,$Y$4:$AV$19,8,FALSE),\"\")","v":""},{"$f":"IFERROR(VLOOKUP(1,$Y$4:$AV$19,9,FALSE),\"\")","v":""},{"$f":"IFERROR(VLOOKUP(1,$Y$4:$AV$19,4,FALSE),\"\")","v":""},{"$f":"IFERROR(VLOOKUP(1,$Y$4:$AV$25,9,FALSE),\"\")","v":""},{"$f":"IFERROR(VLOOKUP(1,$Y$4:$AV$19,5,FALSE),\"\")","v":""},{"$f":"IFERROR(VLOOKUP(1,$Y$4:$AV$25,9,FALSE),\"\")","v":""},{"$f":"IFERROR(VLOOKUP(1,$Y$4:$AV$19,10,FALSE),\"\")","v":""},null,null,null,null,null,{"$f":"COUNTIF(AI4:AI7,\">0\")","v":0},{"$f":"Initial_Info1!B31","v":0},{"$f":"Initial_Info1!C31&\", \"&Initial_Info1!D31&\"        \"&Initial_Info1!G31","v":"0, 0        0"},{"$f":"Initial_Info1!E31","v":0},{"$f":"Initial_Info1!F31","v":0},{"$f":"Initial_Info1!H31","v":0},{"$f":"IFERROR(IF(CoreLokAggSpG!N14=\"\",Blend_AggSpG_PI!P8,CoreLokAggSpG!N14),\"\")","v":""},{"$f":"IFERROR(IF(CoreLokAggSpG!M14=\"\",Blend_AggSpG_PI!O8,CoreLokAggSpG!M14),\"\")","v":""},{"$f":"IFERROR(IF(CoreLokAggSpG!O14=\"\",Blend_AggSpG_PI!Q8,CoreLokAggSpG!O14),\"\")","v":""},{"$f":"Initial_Info1!J31","v":0},{"$f":"Blending!E7","v":0},{"$f":"Initial_Info1!L31","v":0},{"$f":"Initial_Info1!M31","v":0},{"$f":"Initial_Info1!N31","v":0},{"$f":"Initial_Info1!O31","v":0},{"$f":"Initial_Info1!P31","v":0},{"$f":"Initial_Info1!Q31","v":0},{"$f":"Initial_Info1!R31","v":0},{"$f":"Initial_Info1!S31","v":0},{"$f":"Initial_Info1!T31","v":0},{"$f":"Initial_Info1!U31","v":0},{"$f":"Initial_Info1!V31","v":0},{"$f":"Initial_Info1!W31","v":0},{"$f":"Initial_Info1!X31","v":0},{"$f":"IF(Blend_AggSpG_PI!N38=\"\",\"\",IF(Blend_AggSpG_PI!N38=\"Non-Plastic\",\"NP\",Blend_AggSpG_PI!N38))","v":""}]
[null,{"$f":"IFERROR(VLOOKUP(2,$Y$4:$AV$19,2,FALSE),\"\")","v":""},{"$f":"IFERROR(VLOOKUP(2,$Y$4:$AV$19,6,FALSE),\"\")","v":""},{"$f":"IFERROR(VLOOKUP(2,$Y$4:$AV$19,3,FALSE),\"\")","v":""},null,null,null,null,null,null,{"$f":"IFERROR(VLOOKUP(2,$Y$4:$AW$25,25,FALSE),\"\")","v":""},{"$f":"IFERROR(VLOOKUP(2,$Y$4:$AV$19,7,FALSE),\"\")","v":""},{"$f":"IFERROR(VLOOKUP(2,$Y$4:$AV$19,8,FALSE),\"\")","v":""},{"$f":"IFERROR(VLOOKUP(2,$Y$4:$AV$19,9,FALSE),\"\")","v":""},{"$f":"IFERROR(VLOOKUP(2,$Y$4:$AV$19,4,FALSE),\"\")","v":""},"",{"$f":"IFERROR(VLOOKUP(2,$Y$4:$AV$19,5,FALSE),\"\")","v":""},"",{"$f":"IFERROR(VLOOKUP(2,$Y$4:$AV$19,10,FALSE),\"\")","v":""},null,null,null,null,null,{"$f":"COUNTIF(AI4:AI8,\">0\")","v":0},{"$f":"Initial_Info1!B32","v":0},{"$f":"Initial_Info1!C32&\", \"&Initial_Info1!D32&\"        \"&Initial_Info1!G32","v":"0, 0        0"},{"$f":"Initial_Info1!E32","v":0},{"$f":"Initial_Info1!F32","v":0},{"$f":"Initial_Info1!H32","v":0},{"$f":"IFERROR(IF(CoreLokAggSpG!N15=\"\",Blend_AggSpG_PI!P9,CoreLokAggSpG!N15),\"\")","v":""},{"$f":"IFERROR(IF(CoreLokAggSpG!M15=\"\",Blend_AggSpG_PI!O9,CoreLokAggSpG!M15),\"\")","v":""},{"$f":"IFERROR(IF(CoreLokAggSpG!O15=\"\",Blend_AggSpG_PI!Q9,CoreLokAggSpG!O15),\"\")","v":""},{"$f":"Initial_Info1!J32","v":0},{"$f":"Blending!E8","v":0},{"$f":"Initial_Info1!L32","v":0},{"$f":"Initial_Info1!M32","v":0},{"$f":"Initial_Info1!N32","v":0},{"$f":"Initial_Info1!O32","v":0},{"$f":"Initial_Info1!P32","v":0},{"$f":"Initial_Info1!Q32","v":0},{"$f":"Initial_Info1!R32","v":0},{"$f":"Initial_Info1!S32","v":0},{"$f":"Initial_Info1!T32","v":0},{"$f":"Initial_Info1!U32","v":0},{"$f":"Initial_Info1!V32","v":0},{"$f":"Initial_Info1!W32","v":0},{"$f":"Initial_Info1!X32","v":0},{"$f":"IF(Blend_AggSpG_PI!N40=\"\",\"\",IF(Blend_AggSpG_PI!N40=\"Non-Plastic\",\"NP\",Blend_AggSpG_PI!N40))","v":""}]
[null,{"$f":"IFERROR(VLOOKUP(3,$Y$4:$AV$19,2,FALSE),\"\")","v":""},{"$f":"IFERROR(VLOOKUP(3,$Y$4:$AV$19,6,FALSE),\"\")","v":""},{"$f":"IFERROR(VLOOKUP(3,$Y$4:$AV$19,3,FALSE),\"\")","v":""},null,null,null,null,null,null,{"$f":"IFERROR(VLOOKUP(3,$Y$4:$AW$25,25,FALSE),\"\")","v":""},{"$f":"IFERROR(VLOOKUP(3,$Y$4:$AV$19,7,FALSE),\"\")","v":""},{"$f":"IFERROR(VLOOKUP(3,$Y$4:$AV$19,8,FALSE),\"\")","v":""},{"$f":"IFERROR(VLOOKUP(3,$Y$4:$AV$19,9,FALSE),\"\")","v":""},{"$f":"IFERROR(VLOOKUP(3,$Y$4:$AV$19,4,FALSE),\"\")","v":""},"",{"$f":"IFERROR(VLOOKUP(3,$Y$4:$AV$19,5,FALSE),\"\")","v":""},"",{"$f":"IFERROR(VLOOKUP(3,$Y$4:$AV$19,10,FALSE),\"\")","v":""},null,null,null,null,null,{"$f":"COUNTIF(AI4:AI9,\">0\")","v":0},{"$f":"Initial_Info1!B35","v":0},{"$f":"Initial_Info1!C35&\", \"&Initial_Info1!D35&\"        \"&Initial_Info1!G35","v":"0, 0        0"},{"$f":"Initial_Info1!E35","v":0},{"$f":"Initial_Info1!F35","v":0},{"$f":"Initial_Info1!H35","v":0},{"$f":"IFERROR(IF(CoreLokAggSpG!N16=\"\",Blend_AggSpG_PI!M22,CoreLokAggSpG!N16),\"\")","v":""},{"$f":"IFERROR(IF(CoreLokAggSpG!M16=\"\",Blend_AggSpG_PI!L22,CoreLokAggSpG!M16),\"\")","v":""},{"$f":"IFERROR(IF(CoreLokAggSpG!O16=\"\",Blend_AggSpG_PI!N22,CoreLokAggSpG!O16),\"\")","v":""},{"$f":"Initial_Info1!J35","v":0},{"$f":"Blending!E9","v":0},{"$f":"Initial_Info1!L35","v":0},{"$f":"Initial_Info1!M35","v":0},{"$f":"Initial_Info1!N35","v":0},{"$f":"Initial_Info1!O35","v":0},{"$f":"Initial_Info1!P35","v":0},{"$f":"Initial_Info1!Q35","v":0},{"$f":"Initial_Info1!R35","v":0},{"$f":"Initial_Info1!S35","v":0},{"$f":"Initial_Info1!T35","v":0},{"$f":"Initial_Info1!U35","v":0},{"$f":"Initial_Info1!V35","v":0},{"$f":"Initial_Info1!W35","v":0},{"$f":"Initial_Info1!X35","v":0},{"$f":"IF(Blend_AggSpG_PI!N42=\"\",\"\",IF(Blend_AggSpG_PI!N42=\"Non-Plastic\",\"NP\",Blend_AggSpG_PI!N42))","v":""}]
[null,{"$f":"IFERROR(VLOOKUP(4,$Y$4:$AV$19,2,FALSE),\"\")","v":""},{"$f":"IFERROR(VLOOKUP(4,$Y$4:$AV$19,6,FALSE),\"\")","v":""},{"$f":"IFERROR(VLOOKUP(4,$Y$4:$AV$19,3,FALSE),\"\")","v":""},null,null,null,null,null,null,{"$f":"IFERROR(VLOOKUP(4,$Y$4:$AW$25,25,FALSE),\"\")","v":""},{"$f":"IFERROR(VLOOKUP(4,$Y$4:$AV$19,7,FALSE),\"\")","v":""},{"$f":"IFERROR(VLOOKUP(4,$Y$4:$AV$19,8,FALSE),\"\")","v":""},{"$f":"IFERROR(VLOOKUP(4,$Y$4:$AV$19,9,FALSE),\"\")","v":""},{"$f":"IFERROR(VLOOKUP(4,$Y$4:$AV$19,4,FALSE),\"\")","v":""},"",{"$f":"IFERROR(VLOOKUP(4,$Y$4:$AV$19,5,FALSE),\"\")","v":""},"",{"$f":"IFERROR(VLOOKUP(4,$Y$4:$AV$19,10,FALSE),\"\")","v":""},null,null,null,null,null,{"$f":"COUNTIF(AI4:AI10,\">0\")","v":0},{"$f":"Initial_Info1!B36","v":0},{"$f":"Initial_Info1!C36&\", \"&Initial_Info1!D36&\"        \"&Initial_Info1!G36","v":"0, 0        0"},{"$f":"Initial_Info1!E36","v":0},{"$f":"Initial_Info1!F36","v":0},{"$f":"Initial_Info1!H36","v":0},{"$f":"IFERROR(IF(CoreLokAggSpG!N17=\"\",Blend_AggSpG_PI!M23,CoreLokAggSpG!N17),\"\")","v":""},{"$f":"IFERROR(IF(CoreLokAggSpG!M17=\"\",Blend_AggSpG_PI!L23,CoreLokAggSpG!M17),\"\")","v":""},{"$f":"IFERROR(IF(CoreLokAggSpG!O17=\"\",Blend_AggSpG_PI!N23,CoreLokAggSpG!O17),\"\")","v":""},{"$f":"Initial_Info1!J36","v":0},{"$f":"Blending!E10","v":0},{"$f":"Initial_Info1!L36","v":0},{"$f":"Initial_Info1!M36","v":0},{"$f":"Initial_Info1!N36","v":0},{"$f":"Initial_Info1!O36","v":0},{"$f":"Initial_Info1!P36","v":0},{"$f":"Initial_Info1!Q36","v":0},{"$f":"Initial_Info1!R36","v":0},{"$f":"Initial_Info1!S36","v":0},{"$f":"Initial_Info1!T36","v":0},{"$f":"Initial_Info1!U36","v":0},{"$f":"Initial_Info1!V36","v":0},{"$f":"Initial_Info1!W36","v":0},{"$f":"Initial_Info1!X36","v":0},{"$f":"IF(Blend_AggSpG_PI!N44=\"\",\"\",IF(Blend_AggSpG_PI!N44=\"Non-Plastic\",\"NP\",Blend_AggSpG_PI!N44))","v":""}]
[null,{"$f":"IFERROR(VLOOKUP(5,$Y$4:$AV$19,2,FALSE),\"\")","v":""},{"$f":"IFERROR(VLOOKUP(5,$Y$4:$AV$19,6,FALSE),\"\")","v":""},{"$f":"IFERROR(VLOOKUP(5,$Y$4:$AV$19,3,FALSE),\"\")","v":""},null,null,null,null,null,null,{"$f":"IFERROR(VLOOKUP(5,$Y$4:$AW$25,25,FALSE),\"\")","v":""},{"$f":"IFERROR(VLOOKUP(5,$Y$4:$AV$19,7,FALSE),\"\")","v":""},{"$f":"IFERROR(VLOOKUP(5,$Y$4:$AV$19,8,FALSE),\"\")","v":""},{"$f":"IFERROR(VLOOKUP(5,$Y$4:$AV$19,9,FALSE),\"\")","v":""},{"$f":"IFERROR(VLOOKUP(5,$Y$4:$AV$19,4,FALSE),\"\")","v":""},"",{"$f":"IFERROR(VLOOKUP(5,$Y$4:$AV$19,5,FALSE),\"\")","v":""},"",{"$f":"IFERROR(VLOOKUP(5,$Y$4:$AV$19,10,FALSE),\"\")","v":""},null,null,null,null,null,{"$f":"COUNTIF(AI4:AI11,\">0\")","v":0},{"$f":"Initial_Info1!B37","v":0},{"$f":"Initial_Info1!C37&\", \"&Initial_Info1!D37&\"        \"&Initial_Info1!G37","v":"0, 0        0"},{"$f":"Initial_Info1!E37","v":0},{"$f":"Initial_Info1!F37","v":0},{"$f":"Initial_Info1!H37","v":0},{"$f":"IFERROR(IF(CoreLokAggSpG!N18=\"\",Blend_AggSpG_PI!M24,CoreLokAggSpG!N18),\"\")","v":""},{"$f":"IFERROR(IF(CoreLokAggSpG!M18=\"\",Blend_AggSpG_PI!L24,CoreLokAggSpG!M18),\"\")","v":""},{"$f":"IFERROR(IF(CoreLokAggSpG!O18=\"\",Blend_AggSpG_PI!N24,CoreLokAggSpG!O18),\"\")","v":""},{"$f":"Initial_Info1!J37","v":0},{"$f":"Blending!E11","v":0},{"$f":"Initial_Info1!L37","v":0},{"$f":"Initial_Info1!M37","v":0},{"$f":"Initial_Info1!N37","v":0},{"$f":"Initial_Info1!O37","v":0},{"$f":"Initial_Info1!P37","v":0},{"$f":"Initial_Info1!Q37","v":0},{"$f":"Initial_Info1!R37","v":0},{"$f":"Initial_Info1!S37","v":0},{"$f":"Initial_Info1!T37","v":0},{"$f":"Initial_Info1!U37","v":0},{"$f":"Initial_Info1!V37","v":0},{"$f":"Initial_Info1!W37","v":0},{"$f":"Initial_Info1!X37","v":0},{"$f":"IF(Blend_AggSpG_PI!N46=\"\",\"\",IF(Blend_AggSpG_PI!N46=\"Non-Plastic\",\"NP\",Blend_AggSpG_PI!N46))","v":""}]
[null,{"$f":"IFERROR(VLOOKUP(6,$Y$4:$AV$19,2,FALSE),\"\")","v":""},{"$f":"IFERROR(VLOOKUP(6,$Y$4:$AV$19,6,FALSE),\"\")","v":""},{"$f":"IFERROR(VLOOKUP(6,$Y$4:$AV$19,3,FALSE),\"\")","v":""},null,null,null,null,null,null,{"$f":"IFERROR(VLOOKUP(6,$Y$4:$AW$25,25,FALSE),\"\")","v":""},{"$f":"IFERROR(VLOOKUP(6,$Y$4:$AV$19,7,FALSE),\"\")","v":""},{"$f":"IFERROR(VLOOKUP(6,$Y$4:$AV$19,8,FALSE),\"\")","v":""},{"$f":"IFERROR(VLOOKUP(6,$Y$4:$AV$19,9,FALSE),\"\")","v":""},{"$f":"IFERROR(VLOOKUP(6,$Y$4:$AV$19,4,FALSE),\"\")","v":""},"",{"$f":"IFERROR(VLOOKUP(6,$Y$4:$AV$19,5,FALSE),\"\")","v":""},"",{"$f":"IFERROR(VLOOKUP(6,$Y$4:$AV$19,10,FALSE),\"\")","v":""},null,null,null,null,null,{"$f":"COUNTIF(AI4:AI12,\">0\")","v":0},{"$f":"Initial_Info1!B38","v":0},{"$f":"Initial_Info1!C38&\", \"&Initial_Info1!D38&\"        \"&Initial_Info1!G38","v":"0, 0        0"},{"$f":"Initial_Info1!E38","v":0},{"$f":"Initial_Info1!F38","v":0},{"$f":"Initial_Info1!H38","v":0},{"$f":"IFERROR(IF(CoreLokAggSpG!N19=\"\",Blend_AggSpG_PI!M25,CoreLokAggSpG!N19),\"\")","v":""},{"$f":"IFERROR(IF(CoreLokAggSpG!M19=\"\",Blend_AggSpG_PI!L25,CoreLokAggSpG!M19),\"\")","v":""},{"$f":"IFERROR(IF(CoreLokAggSpG!O19=\"\",Blend_AggSpG_PI!N25,CoreLokAggSpG!O19),\"\")","v":""},{"$f":"Initial_Info1!J38","v":0},{"$f":"Blending!E12","v":0},{"$f":"Initial_Info1!L38","v":0},{"$f":"Initial_Info1!M38","v":0},{"$f":"Initial_Info1!N38","v":0},{"$f":"Initial_Info1!O38","v":0},{"$f":"Initial_Info1!P38","v":0},{"$f":"Initial_Info1!Q38","v":0},{"$f":"Initial_Info1!R38","v":0},{"$f":"Initial_Info1!S38","v":0},{"$f":"Initial_Info1!T38","v":0},{"$f":"Initial_Info1!U38","v":0},{"$f":"Initial_Info1!V38","v":0},{"$f":"Initial_Info1!W38","v":0},{"$f":"Initial_Info1!X38","v":0},{"$f":"IF(Blend_AggSpG_PI!N48=\"\",\"\",IF(Blend_AggSpG_PI!N48=\"Non-Plastic\",\"NP\",Blend_AggSpG_PI!N48))","v":""}]
[null,{"$f":"IFERROR(VLOOKUP(7,$Y$4:$AV$19,2,FALSE),\"\")","v":""},{"$f":"IFERROR(VLOOKUP(7,$Y$4:$AV$19,6,FALSE),\"\")","v":""},{"$f":"IFERROR(VLOOKUP(7,$Y$4:$AV$19,3,FALSE),\"\")","v":""},null,null,null,null,null,null,{"$f":"IFERROR(VLOOKUP(7,$Y$4:$AW$25,25,FALSE),\"\")","v":""},{"$f":"IFERROR(VLOOKUP(7,$Y$4:$AV$19,7,FALSE),\"\")","v":""},{"$f":"IFERROR(VLOOKUP(7,$Y$4:$AV$19,8,FALSE),\"\")","v":""},{"$f":"IFERROR(VLOOKUP(7,$Y$4:$AV$19,9,FALSE),\"\")","v":""},{"$f":"IFERROR(VLOOKUP(7,$Y$4:$AV$19,4,FALSE),\"\")","v":""},"",{"$f":"IFERROR(VLOOKUP(7,$Y$4:$AV$19,5,FALSE),\"\")","v":""},"",{"$f":"IFERROR(VLOOKUP(7,$Y$4:$AV$19,10,FALSE),\"\")","v":""},null,null,null,null,null,{"$f":"COUNTIF(AI4:AI13,\">0\")","v":0},{"$f":"Initial_Info1!B39","v":0},{"$f":"Initial_Info1!C39&\", \"&Initial_Info1!D39&\"        \"&Initial_Info1!G39","v":"0, 0        0"},{"$f":"Initial_Info1!E39","v":0},{"$f":"Initial_Info1!F39","v":0},{"$f":"Initial_Info1!H39","v":0},{"$f":"IFERROR(IF(CoreLokAggSpG!N20=\"\",Blend_AggSpG_PI!M26,CoreLokAggSpG!N20),\"\")","v":""},{"$f":"IFERROR(IF(CoreLokAggSpG!M20=\"\",Blend_AggSpG_PI!L26,CoreLokAggSpG!M20),\"\")","v":""},{"$f":"IFERROR(IF(CoreLokAggSpG!O20=\"\",Blend_AggSpG_PI!N26,CoreLokAggSpG!O20),\"\")","v":""},{"$f":"Initial_Info1!J39","v":0},{"$f":"Blending!E13","v":0},{"$f":"Initial_Info1!L39","v":0},{"$f":"Initial_Info1!M39","v":0},{"$f":"Initial_Info1!N39","v":0},{"$f":"Initial_Info1!O39","v":0},{"$f":"Initial_Info1!P39","v":0},{"$f":"Initial_Info1!Q39","v":0},{"$f":"Initial_Info1!R39","v":0},{"$f":"Initial_Info1!S39","v":0},{"$f":"Initial_Info1!T39","v":0},{"$f":"Initial_Info1!U39","v":0},{"$f":"Initial_Info1!V39","v":0},{"$f":"Initial_Info1!W39","v":0},{"$f":"Initial_Info1!X39","v":0},{"$f":"IF(Blend_AggSpG_PI!N50=\"\",\"\",IF(Blend_AggSpG_PI!N50=\"Non-Plastic\",\"NP\",Blend_AggSpG_PI!N50))","v":""}]
[null,{"$f":"IFERROR(VLOOKUP(8,$Y$4:$AV$19,2,FALSE),\"\")","v":""},{"$f":"IFERROR(VLOOKUP(8,$Y$4:$AV$19,6,FALSE),\"\")","v":""},{"$f":"IFERROR(VLOOKUP(8,$Y$4:$AV$19,3,FALSE),\"\")","v":""},null,null,null,null,null,null,{"$f":"IFERROR(VLOOKUP(8,$Y$4:$AW$25,25,FALSE),\"\")","v":""},{"$f":"IFERROR(VLOOKUP(8,$Y$4:$AV$19,7,FALSE),\"\")","v":""},{"$f":"IFERROR(VLOOKUP(8,$Y$4:$AV$19,8,FALSE),\"\")","v":""},{"$f":"IFERROR(VLOOKUP(8,$Y$4:$AV$19,9,FALSE),\"\")","v":""},{"$f":"IFERROR(VLOOKUP(8,$Y$4:$AV$19,4,FALSE),\"\")","v":""},"",{"$f":"IFERROR(VLOOKUP(8,$Y$4:$AV$19,5,FALSE),\"\")","v":""},"",{"$f":"IFERROR(VLOOKUP(8,$Y$4:$AV$19,10,FALSE),\"\")","v":""},null,null,null,null,null,{"$f":"COUNTIF(AI4:AI14,\">0\")","v":0},{"$f":"Initial_Info1!B42","v":0},{"$f":"Initial_Info1!C42&\", \"&Initial_Info1!D42","v":"0, 0"},{"$f":"Initial_Info1!E42","v":0},{"$f":"IF(Initial_Info1!F42=\"\",\"\",TEXT(Initial_Info1!F42,\"#.0\")&\"% AC\")","v":".0% AC"},{"$f":"IF(LEFT(AB14,3)=\"RAP\",\"RAP\",IF(LEFT(AB14,3)=\"RAS\",\"RAS\",\"\"))","v":""},{"$f":"IF(LEFT(AB14,3)=\"RAS\",2.6,IF(Initial_Info1!$B42=\"\",\"\",INDEX(RAP_RAS!$I$15:$W$35,21,MATCH(TRUE,(RAP_RAS!$I$15:$W$15=$Z14),0))))","v":""},{"$f":"AE14","v":""},null,{"$f":"Initial_Info1!J42","v":0},{"$f":"Blending!E14","v":0},{"$f":"Initial_Info1!L42","v":0},{"$f":"Initial_Info1!M42","v":0},{"$f":"Initial_Info1!N42","v":0},{"$f":"Initial_Info1!O42","v":0},{"$f":"Initial_Info1!P42","v":0},{"$f":"Initial_Info1!Q42","v":0},{"$f":"Initial_Info1!R42","v":0},{"$f":"Initial_Info1!S42","v":0},{"$f":"Initial_Info1!T42","v":0},{"$f":"Initial_Info1!U42","v":0},{"$f":"Initial_Info1!V42","v":0},{"$f":"Initial_Info1!W42","v":0},{"$f":"Initial_Info1!X42","v":0},{"$f":"IF(Blend_AggSpG_PI!N52=\"\",\"\",IF(Blend_AggSpG_PI!N52=\"Non-Plastic\",\"NP\",Blend_AggSpG_PI!N52))","v":""}]
[null,{"$f":"IFERROR(VLOOKUP(1,$Y$20:$AI$25,2,FALSE),\"\")","v":""},{"$f":"IFERROR(VLOOKUP(1,$Y$20:$AI$25,6,FALSE),\"\")","v":""},{"$f":"IFERROR(VLOOKUP(1,$Y$20:$AI$25,3,FALSE),\"\")","v":""},null,null,null,null,null,null,null,null,null,null,{"$f":"IFERROR(VLOOKUP(1,$Y$20:$AI$25,4,FALSE),\"\")","v":""},"",{"$f":"IFERROR(VLOOKUP(1,$Y$20:$AI$25,5,FALSE),\"\")","v":""},null,null,null,null,null,null,null,{"$f":"COUNTIF(AI4:AI15,\">0\")","v":0},{"$f":"Initial_Info1!B43","v":0},{"$f":"Initial_Info1!C43&\", \"&Initial_Info1!D43","v":"0, 0"},{"$f":"Initial_Info1!E43","v":0},{"$f":"IF(Initial_Info1!F43=\"\",\"\",TEXT(Initial_Info1!F43,\"#.0\")&\"% AC\")","v":".0% AC"},{"$f":"IF(LEFT(AB15,3)=\"RAP\",\"RAP\",IF(LEFT(AB15,3)=\"RAS\",\"RAS\",\"\"))","v":""},{"$f":"IF(LEFT(AB15,3)=\"RAS\",2.6,IF(Initial_Info1!$B43=\"\",\"\",INDEX(RAP_RAS!$I$15:$W$35,21,MATCH(TRUE,(RAP_RAS!$I$15:$W$15=$Z15),0))))","v":""},"",null,{"$f":"Initial_Info1!J43","v":0},{"$f":"Blending!E15","v":0},{"$f":"Initial_Info1!L43","v":0},{"$f":"Initial_Info1!M43","v":0},{"$f":"Initial_Info1!N43","v":0},{"$f":"Initial_Info1!O43","v":0},{"$f":"Initial_Info1!P43","v":0},{"$f":"Initial_Info1!Q43","v":0},{"$f":"Initial_Info1!R43","v":0},{"$f":"Initial_Info1!S43","v":0},{"$f":"Initial_Info1!T43","v":0},{"$f":"Initial_Info1!U43","v":0},{"$f":"Initial_Info1!V43","v":0},{"$f":"Initial_Info1!W43","v":0},{"$f":"Initial_Info1!X43","v":0},{"$f":"IF(Blend_AggSpG_PI!N54=\"\",\"\",IF(Blend_AggSpG_PI!N54=\"Non-Plastic\",\"NP\",Blend_AggSpG_PI!N54))","v":""}]
[null,{"$f":"IFERROR(VLOOKUP(2,$Y$20:$AI$25,2,FALSE),\"\")","v":""},{"$f":"IFERROR(VLOOKUP(2,$Y$20:$AI$25,6,FALSE),\"\")","v":""},{"$f":"IFERROR(VLOOKUP(2,$Y$20:$AI$25,3,FALSE),\"\")","v":""},null,null,null,null,null,null,null,null,null,null,{"$f":"IFERROR(VLOOKUP(2,$Y$20:$AI$25,4,FALSE),\"\")","v":""},"",{"$f":"IFERROR(VLOOKUP(2,$Y$20:$AI$25,5,FALSE),\"\")","v":""},null,null,null,null,null,null,null,{"$f":"COUNTIF(AI4:AI16,\">0\")","v":0},{"$f":"Initial_Info1!B44","v":0},{"$f":"Initial_Info1!C44&\", \"&Initial_Info1!D44","v":"0, 0"},{"$f":"Initial_Info1!E44","v":0},{"$f":"IF(Initial_Info1!F44=\"\",\"\",TEXT(Initial_Info1!F44,\"#.0\")&\"% AC\")","v":".0% AC"},{"$f":"IF(LEFT(AB16,3)=\"RAP\",\"RAP\",IF(LEFT(AB16,3)=\"RAS\",\"RAS\",\"\"))","v":""},{"$f":"IF(LEFT(AB16,3)=\"RAS\",2.6,IF(Initial_Info1!$B44=\"\",\"\",INDEX(RAP_RAS!$I$15:$W$35,21,MATCH(TRUE,(RAP_RAS!$I$15:$W$15=$Z16),0))))","v":""},"",null,{"$f":"Initial_Info1!J44","v":0},{"$f":"Blending!E16","v":0},{"$f":"Initial_Info1!L44","v":0},{"$f":"Initial_Info1!M44","v":0},{"$f":"Initial_Info1!N44","v":0},{"$f":"Initial_Info1!O44","v":0},{"$f":"Initial_Info1!P44","v":0},{"$f":"Initial_Info1!Q44","v":0},{"$f":"Initial_Info1!R44","v":0},{"$f":"Initial_Info1!S44","v":0},{"$f":"Initial_Info1!T44","v":0},{"$f":"Initial_Info1!U44","v":0},{"$f":"Initial_Info1!V44","v":0},{"$f":"Initial_Info1!W44","v":0},{"$f":"Initial_Info1!X44","v":0}]
[null,{"$f":"IFERROR(VLOOKUP(3,$Y$20:$AI$25,2,FALSE),\"\")","v":""},{"$f":"IFERROR(VLOOKUP(3,$Y$20:$AI$25,6,FALSE),\"\")","v":""},{"$f":"IFERROR(VLOOKUP(3,$Y$20:$AI$25,3,FALSE),\"\")","v":""},null,null,null,null,null,null,{"$f":"IFERROR(VLOOKUP(8,$Y$4:$AW$25,25,FALSE),\"\")","v":""},{"$f":"IFERROR(VLOOKUP(8,$Y$4:$AV$19,7,FALSE),\"\")","v":""},{"$f":"IFERROR(VLOOKUP(8,$Y$4:$AV$19,8,FALSE),\"\")","v":""},{"$f":"IFERROR(VLOOKUP(8,$Y$4:$AV$19,9,FALSE),\"\")","v":""},{"$f":"IFERROR(VLOOKUP(3,$Y$20:$AI$25,4,FALSE),\"\")","v":""},"",{"$f":"IFERROR(VLOOKUP(3,$Y$20:$AI$25,5,FALSE),\"\")","v":""},null,null,null,null,null,null,null,{"$f":"COUNTIF(AI4:AI17,\">0\")","v":0},{"$f":"Initial_Info1!B45","v":0},{"$f":"Initial_Info1!C45&\", \"&Initial_Info1!D45","v":"0, 0"},{"$f":"Initial_Info1!E45","v":0},{"$f":"IF(Initial_Info1!F45=\"\",\"\",TEXT(Initial_Info1!F45,\"#.0\")&\"% AC\")","v":".0% AC"},{"$f":"IF(LEFT(AB17,3)=\"RAP\",\"RAP\",IF(LEFT(AB17,3)=\"RAS\",\"RAS\",\"\"))","v":""},{"$f":"IF(LEFT(AB17,3)=\"RAS\",2.6,IF(Initial_Info1!$B45=\"\",\"\",INDEX(RAP_RAS!$I$15:$W$35,21,MATCH(TRUE,(RAP_RAS!$I$15:$W$15=$Z17),0))))","v":""},"",null,{"$f":"Initial_Info1!J45","v":0},{"$f":"Blending!E17","v":0},{"$f":"Initial_Info1!L45","v":0},{"$f":"Initial_Info1!M45","v":0},{"$f":"Initial_Info1!N45","v":0},{"$f":"Initial_Info1!O45","v":0},{"$f":"Initial_Info1!P45","v":0},{"$f":"Initial_Info1!Q45","v":0},{"$f":"Initial_Info1!R45","v":0},{"$f":"Initial_Info1!S45","v":0},{"$f":"Initial_Info1!T45","v":0},{"$f":"Initial_Info1!U45","v":0},{"$f":"Initial_Info1!V45","v":0},{"$f":"Initial_Info1!W45","v":0},{"$f":"Initial_Info1!X45","v":0}]
[null,{"$f":"IFERROR(VLOOKUP(4,$Y$20:$AI$25,2,FALSE),\"\")","v":""},{"$f":"IFERROR(VLOOKUP(4,$Y$20:$AI$25,6,FALSE),\"\")","v":""},{"$f":"IFERROR(VLOOKUP(4,$Y$20:$AI$25,3,FALSE),\"\")","v":""},null,null,null,null,null,null,{"$f":"IFERROR(VLOOKUP(9,$Y$4:$AW$25,25,FALSE),\"\")","v":""},{"$f":"IFERROR(VLOOKUP(9,$Y$4:$AV$19,7,FALSE),\"\")","v":""},{"$f":"IFERROR(VLOOKUP(9,$Y$4:$AV$19,8,FALSE),\"\")","v":""},{"$f":"IFERROR(VLOOKUP(9,$Y$4:$AV$19,9,FALSE),\"\")","v":""},{"$f":"IFERROR(VLOOKUP(4,$Y$20:$AI$25,4,FALSE),\"\")","v":""},"",{"$f":"IFERROR(VLOOKUP(4,$Y$20:$AI$25,5,FALSE),\"\")","v":""},null,null,null,null,null,null,null,{"$f":"COUNTIF(AI4:AI18,\">0\")","v":0},{"$f":"Initial_Info1!B48","v":0},{"$f":"Initial_Info1!C48&\", \"&Initial_Info1!D48","v":"INNOPHOS, INC., CRANBURY, NJ"},{"$f":"Initial_Info1!E48","v":"Anti-Strip"},{"$f":"IF(OR(Initial_Info1!F48=\"Y\",Initial_Info1!F48=\"YES\"),\"Baghouse\",\"\")","v":""},{"$f":"IF(AB18=\"\",\"\",IF(AC18=\"Baghouse Fines\",\"BH\",IF(AB18=\"Hydrated Lime\",\"HL\",\"MF\")))","v":"MF"},{"$f":"IF(OR(Initial_Info1!G48=\"\",Initial_Info1!G48=0),\"\",Initial_Info1!G48)","v":""},"",null,null,{"$f":"Blending!E18","v":0},{"$f":"Initial_Info1!L48","v":0},{"$f":"Initial_Info1!M48","v":0},{"$f":"Initial_Info1!N48","v":0},{"$f":"Initial_Info1!O48","v":0},{"$f":"Initial_Info1!P48","v":0},{"$f":"Initial_Info1!Q48","v":0},{"$f":"Initial_Info1!R48","v":0},{"$f":"Initial_Info1!S48","v":0},{"$f":"Initial_Info1!T48","v":0},{"$f":"Initial_Info1!U48","v":0},{"$f":"Initial_Info1!V48","v":0},{"$f":"Initial_Info1!W48","v":0},{"$f":"Initial_Info1!X48","v":0}]
[null,{"$f":"IFERROR(VLOOKUP(5,$Y$20:$AI$25,2,FALSE),\"\")","v":""},{"$f":"IFERROR(VLOOKUP(5,$Y$20:$AI$25,6,FALSE),\"\")","v":""},{"$f":"IFERROR(VLOOKUP(5,$Y$20:$AI$25,3,FALSE),\"\")","v":""},null,null,null,null,null,null,{"$f":"IFERROR(VLOOKUP(9,$Y$4:$AW$25,25,FALSE),\"\")","v":""},{"$f":"IFERROR(VLOOKUP(9,$Y$4:$AV$19,7,FALSE),\"\")","v":""},{"$f":"IFERROR(VLOOKUP(9,$Y$4:$AV$19,8,FALSE),\"\")","v":""},{"$f":"IFERROR(VLOOKUP(9,$Y$4:$AV$19,9,FALSE),\"\")","v":""},{"$f":"IFERROR(VLOOKUP(5,$Y$20:$AI$25,4,FALSE),\"\")","v":""},"",{"$f":"IFERROR(VLOOKUP(5,$Y$20:$AI$25,5,FALSE),\"\")","v":""},null,null,null,null,null,null,null,{"$f":"COUNTIF(AI4:AI19,\">0\")","v":0},{"$f":"Initial_Info1!B49","v":0},{"$f":"Initial_Info1!C49&\", \"&Initial_Info1!D49","v":"INNOPHOS, INC., CRANBURY, NJ"},{"$f":"Initial_Info1!E49","v":"Anti-Strip"},{"$f":"IF(OR(Initial_Info1!F49=\"Y\",Initial_Info1!F49=\"YES\"),\"Baghouse\",\"\")","v":""},{"$f":"IF(AB19=\"\",\"\",IF(AC19=\"Baghouse Fines\",\"BH\",IF(AB19=\"Hydrated Lime\",\"HL\",\"MF\")))","v":"MF"},{"$f":"IF(OR(Initial_Info1!G48=\"\",Initial_Info1!G49=0),\"\",Initial_Info1!G49)","v":""},"",null,null,{"$f":"Blending!E19","v":0},{"$f":"Initial_Info1!L49","v":0},{"$f":"Initial_Info1!M49","v":0},{"$f":"Initial_Info1!N49","v":0},{"$f":"Initial_Info1!O49","v":0},{"$f":"Initial_Info1!P49","v":0},{"$f":"Initial_Info1!Q49","v":0},{"$f":"Initial_Info1!R49","v":0},{"$f":"Initial_Info1!S49","v":0},{"$f":"Initial_Info1!T49","v":0},{"$f":"Initial_Info1!U49","v":0},{"$f":"Initial_Info1!V49","v":0},{"$f":"Initial_Info1!W49","v":0},{"$f":"Initial_Info1!X49","v":0}]
[null,{"$f":"Initial_Info1!B12","v":0},{"$f":"IFERROR(VLOOKUP(10,$Y$4:$AV$19,6,FALSE),\"\")","v":""},{"$f":"Initial_Info1!C12&\", \"&Initial_Info1!D12","v":"HERZOG, ELWOOD, KS"},null,null,null,null,{"$f":"Initial_Info1!E12","v":"PG 64-22 Gr. H"},null,null,{"$f":"Initial_Info1!H12","v":0},null,"Mix Temp.",{"$f":"Initial_Info1!E13-5&\" - \"&Initial_Info1!E13+5","v":"-5 - 5"},null,"Mold Temp.",{"$f":"Initial_Info1!E14-5&\" - \"&Initial_Info1!E14+5","v":"-5 - 5"},null,null,null,null,null,null,{"$f":"COUNTIF(AI20,\">0\")","v":0},{"$f":"Initial_Info1!B24","v":0},{"$f":"Initial_Info1!C24&\", \"&Initial_Info1!D24","v":"INNOPHOS, INC., CRANBURY, NJ"},{"$f":"Initial_Info1!E24","v":"INNOVALT W"},{"$f":"IF(Initial_Info1!H24=\"\",\"\",TEXT(Initial_Info1!H24,\"0.0\")&\"% by Weight of Mix\")","v":""},{"$f":"IF(OR(Initial_Info1!F24=\"\",Initial_Info1!F24=0),\"\",\"Fibers\")","v":"Fibers"},{"$f":"IF(AC20=\"\",\"\",1)","v":""},"",null,null,{"$f":"Blending!E20","v":0},{"$f":"Initial_Info1!L24","v":0},{"$f":"Initial_Info1!M24","v":0},{"$f":"Initial_Info1!N24","v":0},{"$f":"Initial_Info1!O24","v":0},{"$f":"Initial_Info1!P24","v":0},{"$f":"Initial_Info1!Q24","v":0},{"$f":"Initial_Info1!R24","v":0},{"$f":"Initial_Info1!S24","v":0},{"$f":"Initial_Info1!T24","v":0},{"$f":"Initial_Info1!U24","v":0},{"$f":"Initial_Info1!V24","v":0},{"$f":"Initial_Info1!W24","v":0},{"$f":"Initial_Info1!X24","v":0}]
[null,null,null,"In-Line Grade for testing after additives:",null,null,null,null,{"$f":"Initial_Info1!F12","v":0},null,null,null,null,null,null,null,null,null,null,null,null,null,null,null,{"$f":"COUNTIF(AI20:AI21,\">0\")","v":0},{"$f":"Initial_Info1!B17","v":0},{"$f":"Initial_Info1!C17&\", \"&Initial_Info1!D17","v":"INNOPHOS, INC., CRANBURY, NJ"},{"$f":"Initial_Info1!E17","v":"INNOVALT W"},{"$f":"IF(Initial_Info1!G17=\"\",\"\",TEXT(Initial_Info1!H17,\"0.00\")&\"% by Weight of \"&Initial_Info1!G17)","v":"0.00% by Weight of Binder"},{"$f":"IF(Initial_Info1!F17=\"\",\"\",Initial_Info1!F17)","v":"Anti-Strip"},null,null,null,null,{"$f":"Initial_Info1!H17","v":0}]
[null,null,null,"Contract Grade for roadway performance:",null,null,null,null,{"$f":"Initial_Info1!G12","v":0},null,null,null,null,null,null,null,null,null,null,null,null,null,null,null,{"$f":"COUNTIF(AI20:AI22,\">0\")","v":0},{"$f":"Initial_Info1!B18","v":0},{"$f":"Initial_Info1!C18&\", \"&Initial_Info1!D18","v":"INNOPHOS, INC., CRANBURY, NJ"},{"$f":"Initial_Info1!E18","v":"INNOVALT W"},{"$f":"IF(Initial_Info1!G18=\"\",\"\",TEXT(Initial_Info1!H18,\"0.00\")&\"% by Weight of \"&Initial_Info1!G18)","v":"0.00% by Weight of Binder"},{"$f":"IF(Initial_Info1!F18=\"\",\"\",Initial_Info1!F18)","v":"Anti-Strip"},null,null,null,null,{"$f":"Initial_Info1!H18","v":0}]
[null,null,{"$f":"B7","v":""},{"$f":"B8","v":""},{"$f":"B9","v":""},{"$f":"B10","v":""},{"$f":"B11","v":""},{"$f":"B12","v":""},{"$f":"B13","v":""},{"$f":"B14","v":""},{"$f":"C23","v":""},"","","","","","","","COMB.",null,null,null,null,null,{"$f":"COUNTIF(AI20:AI23,\">0\")","v":0},{"$f":"Initial_Info1!B19","v":0},{"$f":"Initial_Info1!C19&\", \"&Initial_Info1!D19","v":"INNOPHOS, INC., CRANBURY, NJ"},{"$f":"Initial_Info1!E19","v":"INNOVALT W"},{"$f":"IF(Initial_Info1!G19=\"\",\"\",TEXT(Initial_Info1!H19,\"0.00\")&\"% by Weight of \"&Initial_Info1!G19)","v":"0.00% by Weight of Binder"},{"$f":"IF(Initial_Info1!F19=\"\",\"\",Initial_Info1!F19)","v":"Anti-Strip"},null,null,null,null,{"$f":"Initial_Info1!H19","v":0}]
[null,null,{"$f":"C7","v":""},{"$f":"C8","v":""},{"$f":"C9","v":""},{"$f":"C10","v":""},{"$f":"C11","v":""},{"$f":"C12","v":""},{"$f":"C13","v":""},{"$f":"C14","v":""},{"$f":"IFERROR(VLOOKUP(1,$Y$4:$AV$19,11,FALSE),\"\")","v":""},{"$f":"IFERROR(VLOOKUP(2,$Y$4:$AV$19,11,FALSE),\"\")","v":""},{"$f":"IFERROR(VLOOKUP(3,$Y$4:$AV$19,11,FALSE),\"\")","v":""},{"$f":"IFERROR(VLOOKUP(4,$Y$4:$AV$19,11,FALSE),\"\")","v":""},{"$f":"IFERROR(VLOOKUP(5,$Y$4:$AV$19,11,FALSE),\"\")","v":""},{"$f":"IFERROR(VLOOKUP(6,$Y$4:$AV$19,11,FALSE),\"\")","v":""},{"$f":"IFERROR(VLOOKUP(7,$Y$4:$AV$19,11,FALSE),\"\")","v":""},{"$f":"IFERROR(VLOOKUP(8,$Y$4:$AV$19,11,FALSE),\"\")","v":""},"GRAD.","ColdFeed",null,null,null,null,{"$f":"COUNTIF(AI20:AI24,\">0\")","v":0},{"$f":"Initial_Info1!B20","v":0},{"$f":"Initial_Info1!C20&\", \"&Initial_Info1!D20","v":"INNOPHOS, INC., CRANBURY, NJ"},{"$f":"Initial_Info1!E20","v":"INNOVALT W"},{"$f":"IF(Initial_Info1!G20=\"\",\"\",TEXT(Initial_Info1!H20,\"0.00\")&\"% by Weight of \"&Initial_Info1!G20)","v":"0.00% by Weight of Binder"},{"$f":"IF(Initial_Info1!F20=\"\",\"\",Initial_Info1!F20)","v":"Anti-Strip"},null,null,null,null,{"$f":"Initial_Info1!H20","v":0}]
[null,"2\"",{"$f":"IFERROR(VLOOKUP(1,$Y$4:$AV$19,12,FALSE),\"\")","v":""},{"$f":"IFERROR(VLOOKUP(2,$Y$4:$AV$19,12,FALSE),\"\")","v":""},{"$f":"IFERROR(VLOOKUP(3,$Y$4:$AV$19,12,FALSE),\"\")","v":""},{"$f":"IFERROR(VLOOKUP(4,$Y$4:$AV$19,12,FALSE),\"\")","v":""},{"$f":"IFERROR(VLOOKUP(5,$Y$4:$AV$19,12,FALSE),\"\")","v":""},{"$f":"IFERROR(VLOOKUP(6,$Y$4:$AV$19,12,FALSE),\"\")","v":""},{"$f":"IFERROR(VLOOKUP(7,$Y$4:$AV$19,12,FALSE),\"\")","v":""},{"$f":"IFERROR(VLOOKUP(8,$Y$4:$AV$19,12,FALSE),\"\")","v":""},{"$f":"IFERROR(ROUND(C25*K$24/100,1),\"\")","v":""},{"$f":"IFERROR(ROUND(D25*L$24/100,1),\"\")","v":""},{"$f":"IFERROR(ROUND(E25*M$24/100,1),\"\")","v":""},{"$f":"IFERROR(ROUND(F25*N$24/100,1),\"\")","v":""},{"$f":"IFERROR(ROUND(G25*O$24/100,1),\"\")","v":""},{"$f":"IFERROR(ROUND(H25*P$24/100,1),\"\")","v":""},{"$f":"IFERROR(ROUND(I25*Q$24/100,1),\"\")","v":""},{"$f":"IFERROR(ROUND(J25*R$24/100,1),\"\")","v":""},{"$f":"SUM(K25:R25)","v":0},{"$f":"ROUND((S25-Y40)/(100-$Y$39)*100,1)","v":0},null,null,null,null,{"$f":"COUNTIF(AI20:AI25,\">0\")","v":0},{"$f":"Initial_Info1!B21","v":0},{"$f":"Initial_Info1!C21&\", \"&Initial_Info1!D21","v":"INNOPHOS, INC., CRANBURY, NJ"},{"$f":"Initial_Info1!E21","v":"INNOVALT W"},{"$f":"IF(Initial_Info1!G21=\"\",\"\",TEXT(Initial_Info1!H21,\"0.00\")&\"% by Weight of \"&Initial_Info1!G21)","v":"0.00% by Weight of Binder"},{"$f":"IF(Initial_Info1!F21=\"\",\"\",Initial_Info1!F21)","v":"Anti-Strip"},null,null,null,null,{"$f":"Initial_Info1!H21","v":0}]
[null,"1 1/2\"",{"$f":"IFERROR(VLOOKUP(1,$Y$4:$AV$19,13,FALSE),\"\")","v":""},{"$f":"IFERROR(VLOOKUP(2,$Y$4:$AV$19,13,FALSE),\"\")","v":""},{"$f":"IFERROR(VLOOKUP(3,$Y$4:$AV$19,13,FALSE),\"\")","v":""},{"$f":"IFERROR(VLOOKUP(4,$Y$4:$AV$19,13,FALSE),\"\")","v":""},{"$f":"IFERROR(VLOOKUP(5,$Y$4:$AV$19,13,FALSE),\"\")","v":""},{"$f":"IFERROR(VLOOKUP(6,$Y$4:$AV$19,13,FALSE),\"\")","v":""},{"$f":"IFERROR(VLOOKUP(7,$Y$4:$AV$19,13,FALSE),\"\")","v":""},{"$f":"IFERROR(VLOOKUP(8,$Y$4:$AV$19,13,FALSE),\"\")","v":""},"","","","","","","","",{"$f":"SUM(K26:R26)","v":0},0]
[null,"1\"",{"$f":"IFERROR(VLOOKUP(1,$Y$4:$AV$19,14,FALSE),\"\")","v":""},{"$f":"IFERROR(VLOOKUP(2,$Y$4:$AV$19,14,FALSE),\"\")","v":""},{"$f":"IFERROR(VLOOKUP(3,$Y$4:$AV$19,14,FALSE),\"\")","v":""},{"$f":"IFERROR(VLOOKUP(4,$Y$4:$AV$19,14,FALSE),\"\")","v":""},{"$f":"IFERROR(VLOOKUP(5,$Y$4:$AV$19,14,FALSE),\"\")","v":""},{"$f":"IFERROR(VLOOKUP(6,$Y$4:$AV$19,14,FALSE),\"\")","v":""},{"$f":"IFERROR(VLOOKUP(7,$Y$4:$AV$19,14,FALSE),\"\")","v":""},{"$f":"IFERROR(VLOOKUP(8,$Y$4:$AV$19,14,FALSE),\"\")","v":""},"","","","","","","","",0,0]
[null,"3/4\"",{"$f":"IFERROR(VLOOKUP(1,$Y$4:$AV$19,15,FALSE),\"\")","v":""},{"$f":"IFERROR(VLOOKUP(2,$Y$4:$AV$19,15,FALSE),\"\")","v":""},{"$f":"IFERROR(VLOOKUP(3,$Y$4:$AV$19,15,FALSE),\"\")","v":""},{"$f":"IFERROR(VLOOKUP(4,$Y$4:$AV$19,15,FALSE),\"\")","v":""},{"$f":"IFERROR(VLOOKUP(5,$Y$4:$AV$19,15,FALSE),\"\")","v":""},{"$f":"IFERROR(VLOOKUP(6,$Y$4:$AV$19,15,FALSE),\"\")","v":""},{"$f":"IFERROR(VLOOKUP(7,$Y$4:$AV$19,15,FALSE),\"\")","v":""},{"$f":"IFERROR(VLOOKUP(8,$Y$4:$AV$19,15,FALSE),\"\")","v":""},"","","","","","","","",0,0]
[null,"1/2\"",{"$f":"IFERROR(VLOOKUP(1,$Y$4:$AV$19,16,FALSE),\"\")","v":""},{"$f":"IFERROR(VLOOKUP(2,$Y$4:$AV$19,16,FALSE),\"\")","v":""},{"$f":"IFERROR(VLOOKUP(3,$Y$4:$AV$19,16,FALSE),\"\")","v":""},{"$f":"IFERROR(VLOOKUP(4,$Y$4:$AV$19,16,FALSE),\"\")","v":""},{"$f":"IFERROR(VLOOKUP(5,$Y$4:$AV$19,16,FALSE),\"\")","v":""},{"$f":"IFERROR(VLOOKUP(6,$Y$4:$AV$19,16,FALSE),\"\")","v":""},{"$f":"IFERROR(VLOOKUP(7,$Y$4:$AV$19,16,FALSE),\"\")","v":""},{"$f":"IFERROR(VLOOKUP(8,$Y$4:$AV$19,16,FALSE),\"\")","v":""},"","","","","","","","",0,0]
[null,"3/8\"",{"$f":"IFERROR(VLOOKUP(1,$Y$4:$AV$19,17,FALSE),\"\")","v":""},{"$f":"IFERROR(VLOOKUP(2,$Y$4:$AV$19,17,FALSE),\"\")","v":""},{"$f":"IFERROR(VLOOKUP(3,$Y$4:$AV$19,17,FALSE),\"\")","v":""},{"$f":"IFERROR(VLOOKUP(4,$Y$4:$AV$19,17,FALSE),\"\")","v":""},{"$f":"IFERROR(VLOOKUP(5,$Y$4:$AV$19,17,FALSE),\"\")","v":""},{"$f":"IFERROR(VLOOKUP(6,$Y$4:$AV$19,17,FALSE),\"\")","v":""},{"$f":"IFERROR(VLOOKUP(7,$Y$4:$AV$19,17,FALSE),\"\")","v":""},{"$f":"IFERROR(VLOOKUP(8,$Y$4:$AV$19,17,FALSE),\"\")","v":""},"","","","","","","","",0,0]
[null,"#4",{"$f":"IFERROR(VLOOKUP(1,$Y$4:$AV$19,18,FALSE),\"\")","v":""},{"$f":"IFERROR(VLOOKUP(2,$Y$4:$AV$19,18,FALSE),\"\")","v":""},{"$f":"IFERROR(VLOOKUP(3,$Y$4:$AV$19,18,FALSE),\"\")","v":""},{"$f":"IFERROR(VLOOKUP(4,$Y$4:$AV$19,18,FALSE),\"\")","v":""},{"$f":"IFERROR(VLOOKUP(5,$Y$4:$AV$19,18,FALSE),\"\")","v":""},{"$f":"IFERROR(VLOOKUP(6,$Y$4:$AV$19,18,FALSE),\"\")","v":""},{"$f":"IFERROR(VLOOKUP(7,$Y$4:$AV$19,18,FALSE),\"\")","v":""},{"$f":"IFERROR(VLOOKUP(8,$Y$4:$AV$19,18,FALSE),\"\")","v":""},"","","","","","","","",0,0]
[null,"#8",{"$f":"IFERROR(VLOOKUP(1,$Y$4:$AV$19,19,FALSE),\"\")","v":""},{"$f":"IFERROR(VLOOKUP(2,$Y$4:$AV$19,19,FALSE),\"\")","v":""},{"$f":"IFERROR(VLOOKUP(3,$Y$4:$AV$19,19,FALSE),\"\")","v":""},{"$f":"IFERROR(VLOOKUP(4,$Y$4:$AV$19,19,FALSE),\"\")","v":""},{"$f":"IFERROR(VLOOKUP(5,$Y$4:$AV$19,19,FALSE),\"\")","v":""},{"$f":"IFERROR(VLOOKUP(6,$Y$4:$AV$19,19,FALSE),\"\")","v":""},{"$f":"IFERROR(VLOOKUP(7,$Y$4:$AV$19,19,FALSE),\"\")","v":""},{"$f":"IFERROR(VLOOKUP(8,$Y$4:$AV$19,19,FALSE),\"\")","v":""},"","","","","","","","",0,0]
[null,"#16",{"$f":"IFERROR(VLOOKUP(1,$Y$4:$AV$19,20,FALSE),\"\")","v":""},{"$f":"IFERROR(VLOOKUP(2,$Y$4:$AV$19,20,FALSE),\"\")","v":""},{"$f":"IFERROR(VLOOKUP(3,$Y$4:$AV$19,20,FALSE),\"\")","v":""},{"$f":"IFERROR(VLOOKUP(4,$Y$4:$AV$19,20,FALSE),\"\")","v":""},{"$f":"IFERROR(VLOOKUP(5,$Y$4:$AV$19,20,FALSE),\"\")","v":""},{"$f":"IFERROR(VLOOKUP(6,$Y$4:$AV$19,20,FALSE),\"\")","v":""},{"$f":"IFERROR(VLOOKUP(7,$Y$4:$AV$19,20,FALSE),\"\")","v":""},{"$f":"IFERROR(VLOOKUP(8,$Y$4:$AV$19,20,FALSE),\"\")","v":""},"","","","","","","","",0,0]
[null,"#30",{"$f":"IFERROR(VLOOKUP(1,$Y$4:$AV$19,21,FALSE),\"\")","v":""},{"$f":"IFERROR(VLOOKUP(2,$Y$4:$AV$19,21,FALSE),\"\")","v":""},{"$f":"IFERROR(VLOOKUP(3,$Y$4:$AV$19,21,FALSE),\"\")","v":""},{"$f":"IFERROR(VLOOKUP(4,$Y$4:$AV$19,21,FALSE),\"\")","v":""},{"$f":"IFERROR(VLOOKUP(5,$Y$4:$AV$19,21,FALSE),\"\")","v":""},{"$f":"IFERROR(VLOOKUP(6,$Y$4:$AV$19,21,FALSE),\"\")","v":""},{"$f":"IFERROR(VLOOKUP(7,$Y$4:$AV$19,21,FALSE),\"\")","v":""},{"$f":"IFERROR(VLOOKUP(8,$Y$4:$AV$19,21,FALSE),\"\")","v":""},"","","","","","","","",0,0]
[null,"#50",{"$f":"IFERROR(VLOOKUP(1,$Y$4:$AV$19,22,FALSE),\"\")","v":""},{"$f":"IFERROR(VLOOKUP(2,$Y$4:$AV$19,22,FALSE),\"\")","v":""},{"$f":"IFERROR(VLOOKUP(3,$Y$4:$AV$19,22,FALSE),\"\")","v":""},{"$f":"IFERROR(VLOOKUP(4,$Y$4:$AV$19,22,FALSE),\"\")","v":""},{"$f":"IFERROR(VLOOKUP(5,$Y$4:$AV$19,22,FALSE),\"\")","v":""},{"$f":"IFERROR(VLOOKUP(6,$Y$4:$AV$19,22,FALSE),\"\")","v":""},{"$f":"IFERROR(VLOOKUP(7,$Y$4:$AV$19,22,FALSE),\"\")","v":""},{"$f":"IFERROR(VLOOKUP(8,$Y$4:$AV$19,22,FALSE),\"\")","v":""},"","","","","","","","",0,0]
[null,"#100",{"$f":"IFERROR(VLOOKUP(1,$Y$4:$AV$19,23,FALSE),\"\")","v":""},{"$f":"IFERROR(VLOOKUP(2,$Y$4:$AV$19,23,FALSE),\"\")","v":""},{"$f":"IFERROR(VLOOKUP(3,$Y$4:$AV$19,23,FALSE),\"\")","v":""},{"$f":"IFERROR(VLOOKUP(4,$Y$4:$AV$19,23,FALSE),\"\")","v":""},{"$f":"IFERROR(VLOOKUP(5,$Y$4:$AV$19,23,FALSE),\"\")","v":""},{"$f":"IFERROR(VLOOKUP(6,$Y$4:$AV$19,23,FALSE),\"\")","v":""},{"$f":"IFERROR(VLOOKUP(7,$Y$4:$AV$19,23,FALSE),\"\")","v":""},{"$f":"IFERROR(VLOOKUP(8,$Y$4:$AV$19,23,FALSE),\"\")","v":""},"","","","","","","","",0,0]
[null,"#200",{"$f":"IFERROR(VLOOKUP(1,$Y$4:$AV$19,24,FALSE),\"\")","v":""},{"$f":"IFERROR(VLOOKUP(2,$Y$4:$AV$19,24,FALSE),\"\")","v":""},{"$f":"IFERROR(VLOOKUP(3,$Y$4:$AV$19,24,FALSE),\"\")","v":""},{"$f":"IFERROR(VLOOKUP(4,$Y$4:$AV$19,24,FALSE),\"\")","v":""},{"$f":"IFERROR(VLOOKUP(5,$Y$4:$AV$19,24,FALSE),\"\")","v":""},{"$f":"IFERROR(VLOOKUP(6,$Y$4:$AV$19,24,FALSE),\"\")","v":""},{"$f":"IFERROR(VLOOKUP(7,$Y$4:$AV$19,24,FALSE),\"\")","v":""},{"$f":"IFERROR(VLOOKUP(8,$Y$4:$AV$19,24,FALSE),\"\")","v":""},"","","","","","","","",0,0]
[null,"Gmm =",{"$f":"IFERROR(IF(J3=\"Gyratory\",'403_Graphs'!G23,'401_Graphs'!G23),100/(S39/C41+S41/L20))","v":{"$error":"#DIV/0!"}},null,"% VOIDS =",{"$f":"IF(LEFT(Initial_Info1!C7,2)=\"UB\",'Shot Rate'!B11,IF(J3=\"Gyratory\",'403_Graphs'!G20,'401_Graphs'!G20))","v":4},null,"TSR =",{"$f":"IF(ISBLANK(T_283!D42),\"\",T_283!D42)","v":""},null,"TSR Weight =",{"$f":"IF(ISBLANK(T_283!M14),\"\",T_283!M14)","v":""},{"$f":"IF(Initial_Info1!F7=\"Gyratory\",\"Nini =\",\"\")","v":"Nini ="},{"$f":"IF(Initial_Info1!E6=\"\",\"\",Initial_Info1!E6)","v":""},null,null,null,"MIX COMPOSTITION",null,"BH","MF","RAP","RAS","RAP2","TOTAL"]
[null,"Gmb =",{"$f":"IFERROR(IF(LEFT(Initial_Info1!C7,2)=\"UB\",'Shot Rate'!B9,IF(J3=\"Gyratory\",'403_Graphs'!G27,'401_Graphs'!G26)),(100-F38)*C38/100)","v":{"$error":"#DIV/0!"}},null,"V.M.A. =",{"$f":"IFERROR(IF(LEFT(Initial_Info1!C7,2)=\"UB\",\"\",IF(J3=\"Gyratory\",'403_Graphs'!G21,'401_Graphs'!G21)),100-S39*C39/C40)","v":{"$error":"#DIV/0!"}},null,"D/B Ratio =",{"$f":"IFERROR(IF(LEFT(Initial_Info1!C7,2)=\"UB\",\"\",IF(J3=\"SP\",'403_Graphs'!G26,'401_Graphs'!G25)),ROUND(S37/Recycle_Binder_Contrib!B18,1))","v":{"$error":"#DIV/0!"}},null,null,null,{"$f":"IF(Initial_Info1!F7=\"Gyratory\",\"Ndes =\",\"Blows\")","v":"Ndes ="},{"$f":"IF(Initial_Info1!E7=\"\",\"\",Initial_Info1!E7)","v":{"$error":"#N/A"}},null,null,null,"MIN. AGG.",{"$f":"100-S41-S42","v":94.6},{"$f":"INDEX($K$24:$R$24,1,MATCH(\"BH\",$C$24:$J$24,0))","v":{"$error":"#N/A"}},{"$f":"INDEX($K$24:$R$24,1,MATCH(\"MF\",$C$24:$J$24,0))","v":{"$error":"#N/A"}},{"$f":"INDEX($K$24:$R$24,1,MATCH(\"RAP\",$C$24:$J$24,0))","v":{"$error":"#N/A"}},{"$f":"INDEX($K$24:$R$24,1,MATCH(\"RAS\",$C$24:$J$24,0))","v":{"$error":"#N/A"}},{"$f":"IF(COUNTIF(C24:J24,\"RAP\")>1,INDEX($K$24:$R$24,1,MATCH(\"RAP\",$C$24:$J$24,1)),\"\")","v":""},{"$f":"SUM(IF(ISERROR(T39:X39),\"\",T39:X39))","v":0}]
[null,"Gsb =",{"$f":"Blending!H22","v":{"$error":"#DIV/0!"}},null,"% FILLED =",{"$f":"IF(F39=\"\",\"\",(F39-F38)/F39*100)","v":{"$error":"#DIV/0!"}},null,"Gyro Weight =",{"$f":"IFERROR(Initial_Info1!C8,\"\")","v":0},null,null,null,{"$f":"IF(Initial_Info1!F7=\"Gyratory\",\"Nmax =\",\"\")","v":"Nmax ="},{"$f":"IF(Initial_Info1!E8=\"\",\"\",Initial_Info1!E8)","v":""},null,null,null,"VIRGIN ASPHALT CONTENT",{"$f":"Recycle_Binder_Contrib!B5","v":5.4},{"$f":"INDEX($K$25:$R$37,1,MATCH(\"BH\",$C$24:$J$24,0))","v":{"$error":"#N/A"}},{"$f":"INDEX($K$25:$R$37,1,MATCH(\"MF\",$C$24:$J$24,0))","v":{"$error":"#N/A"}},{"$f":"INDEX($K$25:$R$37,1,MATCH(\"RAP\",$C$24:$J$24,0))","v":{"$error":"#N/A"}},{"$f":"INDEX($K$25:$R$37,1,MATCH(\"RAS\",$C$24:$J$24,0))","v":{"$error":"#N/A"}},{"$f":"IF(COUNTIF($C$24:$J$24,\"RAP\")>1,INDEX($K$25:$R$37,1,MATCH(\"RAP\",$C$24:$J$24,1)),\"\")","v":""},{"$f":"SUM(IF(ISERROR(T40:X40),\"\",T40:X40))","v":0}]
[null,"Gse =",{"$f":"IFERROR(IF(J3=\"Gyratory\",'403_Graphs'!G29,'401_Graphs'!G28),MO_JMF_Std!C40+(Blending!D22-Blending!H22)*IF(MO_JMF_Std!N7<1,0.5,IF(MO_JMF_Std!N7>2.5,0.8,0.7)))","v":{"$error":"#DIV/0!"}},null,null,null,null,null,null,null,null,null,"Mold Dia.",{"$f":"IF(Initial_Info1!H7=\"\",\"\",Initial_Info1!H7&\" \"&Initial_Info1!I7)","v":"150 mm"},null,null,null,"TOTAL AC",{"$f":"IFERROR(IF(J3=\"Gyratory\",'403_Graphs'!G19,'401_Graphs'!G19),Batching!A53)","v":5.4},{"$f":"INDEX($K$25:$R$37,2,MATCH(\"BH\",$C$24:$J$24,0))","v":{"$error":"#N/A"}},{"$f":"INDEX($K$25:$R$37,2,MATCH(\"MF\",$C$24:$J$24,0))","v":{"$error":"#N/A"}},{"$f":"INDEX($K$25:$R$37,2,MATCH(\"RAP\",$C$24:$J$24,0))","v":{"$error":"#N/A"}},{"$f":"INDEX($K$25:$R$37,2,MATCH(\"RAS\",$C$24:$J$24,0))","v":{"$error":"#N/A"}},{"$f":"IF(COUNTIF($C$24:$J$24,\"RAP\")>1,INDEX($K$25:$R$37,2,MATCH(\"RAP\",$C$24:$J$24,1)),\"\")","v":""},{"$f":"SUM(IF(ISERROR(T41:X41),\"\",T41:X41))","v":0}]
[null,null,"Flat & Elongated","5:1 =",{"$f":"IF(Consensus!H14=\"\",\"\",Consensus!H14)","v":""},null,"Clay Content =",{"$f":"IF(Consensus!L28=\"\",\"\",Consensus!L28)","v":""},null,"Deleterious =",{"$f":"Consensus!L39","v":""},null,"Stability =",{"$f":"IF(Initial_Info1!F7=\"Marshall\",'401_Graphs'!G24,\"\")","v":""},null,null,null,"Fibers =",{"$f":"IF(AI20=0,0,AI20)","v":0},{"$f":"INDEX($K$25:$R$37,3,MATCH(\"BH\",$C$24:$J$24,0))","v":{"$error":"#N/A"}},{"$f":"INDEX($K$25:$R$37,3,MATCH(\"MF\",$C$24:$J$24,0))","v":{"$error":"#N/A"}},{"$f":"INDEX($K$25:$R$37,3,MATCH(\"RAP\",$C$24:$J$24,0))","v":{"$error":"#N/A"}},{"$f":"INDEX($K$25:$R$37,3,MATCH(\"RAS\",$C$24:$J$24,0))","v":{"$error":"#N/A"}},{"$f":"IF(COUNTIF($C$24:$J$24,\"RAP\")>1,INDEX($K$25:$R$37,3,MATCH(\"RAP\",$C$24:$J$24,1)),\"\")","v":""},{"$f":"SUM(IF(ISERROR(T42:X42),\"\",T42:X42))","v":0}]
[null,null,null,"3:1 =",{"$f":"IF(Consensus!Q14=\"\",\"\",Consensus!Q14)","v":""},null,"FAA =",{"$f":"IF(Consensus!F35=\"\",\"\",Consensus!F35)","v":""},null,"CAA =",{"$f":"IF(Consensus!F44=\"\",\"\",Consensus!F44&\" / \"&Consensus!F45)","v":"100 / 100"},null,null,null,null,null,null,"RAP Asphalt Binder Replacement =",{"$f":"IF(Recycle_Binder_Contrib!C24=\"\",\"\",Recycle_Binder_Contrib!C24)","v":""},{"$f":"INDEX($K$25:$R$37,4,MATCH(\"BH\",$C$24:$J$24,0))","v":{"$error":"#N/A"}},{"$f":"INDEX($K$25:$R$37,4,MATCH(\"MF\",$C$24:$J$24,0))","v":{"$error":"#N/A"}},{"$f":"INDEX($K$25:$R$37,4,MATCH(\"RAP\",$C$24:$J$24,0))","v":{"$error":"#N/A"}},{"$f":"INDEX($K$25:$R$37,4,MATCH(\"RAS\",$C$24:$J$24,0))","v":{"$error":"#N/A"}},{"$f":"IF(COUNTIF($C$24:$J$24,\"RAP\")>1,INDEX($K$25:$R$37,4,MATCH(\"RAP\",$C$24:$J$24,1)),\"\")","v":""},{"$f":"SUM(IF(ISERROR(T43:X43),\"\",T43:X43))","v":0}]
[null,"Draindown =",{"$f":"IF('SMA_VCA-Draindown'!H28=\"\",\"\",'SMA_VCA-Draindown'!H28&\"% @ \"&'SMA_VCA-Draindown'!H18&\"°\")","v":""},null,"VCAmix=",{"$f":"IF('SMA_VCA-Draindown'!E12=\"\",\"\",'SMA_VCA-Draindown'!E12)","v":""},null,null,null,"Film Thickness =",{"$f":"'Film Thickness'!C32","v":{"$error":"#DIV/0!"}},null,"Methylene Blue = ",{"$f":"Consensus!Q36","v":""},null,null,null,"RAS Asphalt Binder Replacement =",{"$f":"IF(Recycle_Binder_Contrib!D24=\"\",\"\",Recycle_Binder_Contrib!D24)","v":""},{"$f":"INDEX($K$25:$R$37,5,MATCH(\"BH\",$C$24:$J$24,0))","v":{"$error":"#N/A"}},{"$f":"INDEX($K$25:$R$37,5,MATCH(\"MF\",$C$24:$J$24,0))","v":{"$error":"#N/A"}},{"$f":"INDEX($K$25:$R$37,5,MATCH(\"RAP\",$C$24:$J$24,0))","v":{"$error":"#N/A"}},{"$f":"INDEX($K$25:$R$37,5,MATCH(\"RAS\",$C$24:$J$24,0))","v":{"$error":"#N/A"}},{"$f":"IF(COUNTIF($C$24:$J$24,\"RAP\")>1,INDEX($K$25:$R$37,5,MATCH(\"RAP\",$C$24:$J$24,1)),\"\")","v":""},{"$f":"SUM(IF(ISERROR(T44:X44),\"\",T44:X44))","v":0}]
[null,null,{"$f":"IF('SMA_VCA-Draindown'!J28=\"\",\"\",'SMA_VCA-Draindown'!J28&\"% @ \"&'SMA_VCA-Draindown'!J18&\"°\")","v":""},null,"VCAdrc=",{"$f":"IF('SMA_VCA-Draindown'!E13=\"\",\"\",'SMA_VCA-Draindown'!E13)","v":""},null,null,null,"Target Emulsion Rate =",{"$f":"IF(LEFT(Initial_Info1!C7,2)=\"UB\",TEXT('Shot Rate'!SRmax,\"0.00\")&\" \"&'Shot Rate'!I31,\"\")","v":""},null,null,null,null,null,null,{"$f":"'Non-Carbonate'!B24&\" Non-Carbonate =\"","v":{"$error":"#N/A"}},{"$f":"'Non-Carbonate'!E27","v":""},{"$f":"INDEX($K$25:$R$37,6,MATCH(\"BH\",$C$24:$J$24,0))","v":{"$error":"#N/A"}},{"$f":"INDEX($K$25:$R$37,6,MATCH(\"MF\",$C$24:$J$24,0))","v":{"$error":"#N/A"}},{"$f":"INDEX($K$25:$R$37,6,MATCH(\"RAP\",$C$24:$J$24,0))","v":{"$error":"#N/A"}},{"$f":"INDEX($K$25:$R$37,6,MATCH(\"RAS\",$C$24:$J$24,0))","v":{"$error":"#N/A"}},{"$f":"IF(COUNTIF($C$24:$J$24,\"RAP\")>1,INDEX($K$25:$R$37,6,MATCH(\"RAP\",$C$24:$J$24,1)),\"\")","v":""},{"$f":"SUM(IF(ISERROR(T45:X45),\"\",T45:X45))","v":0}]
[null,null,null,null,null,null,null,null,null,null,null,null,null,null,null,null,null,null,null,{"$f":"INDEX($K$25:$R$37,7,MATCH(\"BH\",$C$24:$J$24,0))","v":{"$error":"#N/A"}},{"$f":"INDEX($K$25:$R$37,7,MATCH(\"MF\",$C$24:$J$24,0))","v":{"$error":"#N/A"}},{"$f":"INDEX($K$25:$R$37,7,MATCH(\"RAP\",$C$24:$J$24,0))","v":{"$error":"#N/A"}},{"$f":"INDEX($K$25:$R$37,7,MATCH(\"RAS\",$C$24:$J$24,0))","v":{"$error":"#N/A"}},{"$f":"IF(COUNTIF($C$24:$J$24,\"RAP\")>1,INDEX($K$25:$R$37,7,MATCH(\"RAP\",$C$24:$J$24,1)),\"\")","v":""},{"$f":"SUM(IF(ISERROR(T46:X46),\"\",T46:X46))","v":0}]
[null,null,null,null,null,null,null,null,null,null,null,null,null,null,null,null,null,null,null,{"$f":"INDEX($K$25:$R$37,8,MATCH(\"BH\",$C$24:$J$24,0))","v":{"$error":"#N/A"}},{"$f":"INDEX($K$25:$R$37,8,MATCH(\"MF\",$C$24:$J$24,0))","v":{"$error":"#N/A"}},{"$f":"INDEX($K$25:$R$37,8,MATCH(\"RAP\",$C$24:$J$24,0))","v":{"$error":"#N/A"}},{"$f":"INDEX($K$25:$R$37,8,MATCH(\"RAS\",$C$24:$J$24,0))","v":{"$error":"#N/A"}},{"$f":"IF(COUNTIF($C$24:$J$24,\"RAP\")>1,INDEX($K$25:$R$37,8,MATCH(\"RAP\",$C$24:$J$24,1)),\"\")","v":""},{"$f":"SUM(IF(ISERROR(T47:X47),\"\",T47:X47))","v":0}]
[null,null,null,null,null,null,null,null,null,null,null,null,null,null,null,null,null,null,null,{"$f":"INDEX($K$25:$R$37,9,MATCH(\"BH\",$C$24:$J$24,0))","v":{"$error":"#N/A"}},{"$f":"INDEX($K$25:$R$37,9,MATCH(\"MF\",$C$24:$J$24,0))","v":{"$error":"#N/A"}},{"$f":"INDEX($K$25:$R$37,9,MATCH(\"RAP\",$C$24:$J$24,0))","v":{"$error":"#N/A"}},{"$f":"INDEX($K$25:$R$37,9,MATCH(\"RAS\",$C$24:$J$24,0))","v":{"$error":"#N/A"}},{"$f":"IF(COUNTIF($C$24:$J$24,\"RAP\")>1,INDEX($K$25:$R$37,9,MATCH(\"RAP\",$C$24:$J$24,1)),\"\")","v":""},{"$f":"SUM(IF(ISERROR(T48:X48),\"\",T48:X48))","v":0}]
[null,null,null,null,null,null,null,null,null,null,null,null,null,null,null,null,null,null,null,{"$f":"INDEX($K$25:$R$37,10,MATCH(\"BH\",$C$24:$J$24,0))","v":{"$error":"#N/A"}},{"$f":"INDEX($K$25:$R$37,10,MATCH(\"MF\",$C$24:$J$24,0))","v":{"$error":"#N/A"}},{"$f":"INDEX($K$25:$R$37,10,MATCH(\"RAP\",$C$24:$J$24,0))","v":{"$error":"#N/A"}},{"$f":"INDEX($K$25:$R$37,10,MATCH(\"RAS\",$C$24:$J$24,0))","v":{"$error":"#N/A"}},{"$f":"IF(COUNTIF($C$24:$J$24,\"RAP\")>1,INDEX($K$25:$R$37,10,MATCH(\"RAP\",$C$24:$J$24,1)),\"\")","v":""},{"$f":"SUM(IF(ISERROR(T49:X49),\"\",T49:X49))","v":0}]
[null,null,null,null,null,null,null,null,null,null,null,null,null,null,null,null,null,null,null,{"$f":"INDEX($K$25:$R$37,11,MATCH(\"BH\",$C$24:$J$24,0))","v":{"$error":"#N/A"}},{"$f":"INDEX($K$25:$R$37,11,MATCH(\"MF\",$C$24:$J$24,0))","v":{"$error":"#N/A"}},{"$f":"INDEX($K$25:$R$37,11,MATCH(\"RAP\",$C$24:$J$24,0))","v":{"$error":"#N/A"}},{"$f":"INDEX($K$25:$R$37,11,MATCH(\"RAS\",$C$24:$J$24,0))","v":{"$error":"#N/A"}},{"$f":"IF(COUNTIF($C$24:$J$24,\"RAP\")>1,INDEX($K$25:$R$37,11,MATCH(\"RAP\",$C$24:$J$24,1)),\"\")","v":""},{"$f":"SUM(IF(ISERROR(T50:X50),\"\",T50:X50))","v":0}]
[null,null,null,null,null,null,null,null,null,null,null,null,null,null,null,null,null,null,null,{"$f":"INDEX($K$25:$R$37,12,MATCH(\"BH\",$C$24:$J$24,0))","v":{"$error":"#N/A"}},{"$f":"INDEX($K$25:$R$37,12,MATCH(\"MF\",$C$24:$J$24,0))","v":{"$error":"#N/A"}},{"$f":"INDEX($K$25:$R$37,12,MATCH(\"RAP\",$C$24:$J$24,0))","v":{"$error":"#N/A"}},{"$f":"INDEX($K$25:$R$37,12,MATCH(\"RAS\",$C$24:$J$24,0))","v":{"$error":"#N/A"}},{"$f":"IF(COUNTIF($C$24:$J$24,\"RAP\")>1,INDEX($K$25:$R$37,12,MATCH(\"RAP\",$C$24:$J$24,1)),\"\")","v":""},{"$f":"SUM(IF(ISERROR(T51:X51),\"\",T51:X51))","v":0}]
[null,null,null,null,null,null,null,null,null,null,null,null,null,null,null,null,null,null,null,{"$f":"INDEX($K$25:$R$37,13,MATCH(\"BH\",$C$24:$J$24,0))","v":{"$error":"#N/A"}},{"$f":"INDEX($K$25:$R$37,13,MATCH(\"MF\",$C$24:$J$24,0))","v":{"$error":"#N/A"}},{"$f":"INDEX($K$25:$R$37,13,MATCH(\"RAP\",$C$24:$J$24,0))","v":{"$error":"#N/A"}},{"$f":"INDEX($K$25:$R$37,13,MATCH(\"RAS\",$C$24:$J$24,0))","v":{"$error":"#N/A"}},{"$f":"IF(COUNTIF($C$24:$J$24,\"RAP\")>1,INDEX($K$25:$R$37,13,MATCH(\"RAP\",$C$24:$J$24,1)),\"\")","v":""},{"$f":"SUM(IF(ISERROR(T52:X52),\"\",T52:X52))","v":0}]

{"sheet":"Blend_AggSpG_PI","index":9,"n_rows":51,"n_cols":19,"rows_kept":51,"cut":false,"hidden":false,"merged":[[0,13,0,16],[31,0,32,0],[31,1,32,1],[31,2,32,2],[31,13,32,13],[27,4,27,9],[33,0,34,0],[33,1,34,1],[33,2,34,2],[33,13,34,13],[35,0,36,0],[35,1,36,1],[35,2,36,2],[35,13,36,13],[37,0,38,0],[37,1,38,1],[37,2,38,2],[37,13,38,13],[39,0,40,0],[39,1,40,1],[39,2,40,2],[39,13,40,13],[41,0,42,0],[41,1,42,1],[41,2,42,2],[41,13,42,13],[43,0,44,0],[43,1,44,1],[43,2,44,2],[43,13,44,13],[49,0,50,0],[49,1,50,1],[49,2,50,2],[49,13,50,13],[45,0,46,0],[45,1,46,1],[45,2,46,2],[45,13,46,13],[47,0,48,0],[47,1,48,1],[47,2,48,2],[47,13,48,13]]}
[null,null,null,"AGGREGATE SPECIFIC GRAVITY",null,null,null,null,null,null,null,null,null,"T 85 (COMBINED)"]
[null,"AASHTO T 85 / ASTM C127",null,null,null,"Mass in Water","SSD Mass","Dry Mass","Apparent Sp.Gr.","SSD    Sp.Gr.","Bulk Sp.Gr.","Absorption",null,"Apparent Sp.Gr.","SSD    Sp.Gr.","Bulk    Sp.Gr.","Absorption"]
[null,null,null,null,null,"C","B","A","=A/(A-C)","=B/(B-C)","=A/(B-C)","=100*(B-A)/A",null,"=A/(A-C)","=B/(B-C)","=A/(B-C)","=100*(B-A)/A"]
["Material ID","Source","Grading","+ #4","+ #8","(g)","(g)","(g)",null,null,null,"(%)",null,null,null,null,"(%)"]
[{"$f":"IF(Initial_Info1!B28=\"\",\"\",Initial_Info1!B28)","v":""},{"$f":"IF(Initial_Info1!C28=\"\",\"\",Initial_Info1!C28)","v":0},{"$f":"Initial_Info1!H28&\" \"&Initial_Info1!I28","v":"0 0"},{"$f":"IF(B5=\"\",\"\",100-Initial_Info1!R28)","v":100},{"$f":"IF(B5=\"\",\"\",100-Initial_Info1!S28)","v":100},{"$f":"IF($A5=\"\",\"\",IF(OR(ISNA(INDEX(AggSG,MATCH(TRUE,(AggSGID=$A5),0),6)),ISBLANK(INDEX(AggSG,MATCH(TRUE,(AggSGID=$A5),0),6))),\"\",INDEX(AggSG,MATCH(TRUE,(AggSGID=$A5),0),6)))","v":""},{"$f":"IF($A5=\"\",\"\",IF(OR(ISNA(INDEX(AggSG,MATCH(TRUE,(AggSGID=$A5),0),7)),ISBLANK(INDEX(AggSG,MATCH(TRUE,(AggSGID=$A5),0),7))),\"\",INDEX(AggSG,MATCH(TRUE,(AggSGID=$A5),0),7)))","v":""},{"$f":"IF($A5=\"\",\"\",IF(OR(ISNA(INDEX(AggSG,MATCH(TRUE,(AggSGID=$A5),0),8)),ISBLANK(INDEX(AggSG,MATCH(TRUE,(AggSGID=$A5),0),8))),\"\",INDEX(AggSG,MATCH(TRUE,(AggSGID=$A5),0),8)))","v":""},{"$f":"IF($H5=\"\",\"\",INDEX(AggSG,MATCH(TRUE,(AggSGID=$A5),0),9))","v":""},{"$f":"IF($H5=\"\",\"\",INDEX(AggSG,MATCH(TRUE,(AggSGID=$A5),0),10))","v":""},{"$f":"IF($H5=\"\",\"\",INDEX(AggSG,MATCH(TRUE,(AggSGID=$A5),0),11))","v":""},{"$f":"IF($H5=\"\",\"\",INDEX(AggSG,MATCH(TRUE,(AggSGID=$A5),0),12))","v":""},{"$f":"IF($H5=\"\",\"\",INDEX(AggSG,MATCH(TRUE,(AggSGID=$A5),0),13))","v":""},{"$f":"IF($H5=\"\",\"\",INDEX(AggSG,MATCH(TRUE,(AggSGID=$A5),0),26))","v":""},{"$f":"IF($H5=\"\",\"\",INDEX(AggSG,MATCH(TRUE,(AggSGID=$A5),0),27))","v":""},{"$f":"IF($H5=\"\",\"\",INDEX(AggSG,MATCH(TRUE,(AggSGID=$A5),0),28))","v":""},{"$f":"IF($H5=\"\",\"\",INDEX(AggSG,MATCH(TRUE,(AggSGID=$A5),0),29))","v":""}]
[{"$f":"IF(Initial_Info1!B29=\"\",\"\",Initial_Info1!B29)","v":""},{"$f":"IF(Initial_Info1!C29=\"\",\"\",Initial_Info1!C29)","v":0},{"$f":"Initial_Info1!H29&\" \"&Initial_Info1!I29","v":"0 0"},{"$f":"IF(B6=\"\",\"\",100-Initial_Info1!R29)","v":100},{"$f":"IF(B6=\"\",\"\",100-Initial_Info1!S29)","v":100},{"$f":"IF($A6=\"\",\"\",IF(OR(ISNA(INDEX(AggSG,MATCH(TRUE,(AggSGID=$A6),0),6)),ISBLANK(INDEX(AggSG,MATCH(TRUE,(AggSGID=$A6),0),6))),\"\",INDEX(AggSG,MATCH(TRUE,(AggSGID=$A6),0),6)))","v":""},{"$f":"IF($A6=\"\",\"\",IF(OR(ISNA(INDEX(AggSG,MATCH(TRUE,(AggSGID=$A6),0),7)),ISBLANK(INDEX(AggSG,MATCH(TRUE,(AggSGID=$A6),0),7))),\"\",INDEX(AggSG,MATCH(TRUE,(AggSGID=$A6),0),7)))","v":""},{"$f":"IF($A6=\"\",\"\",IF(OR(ISNA(INDEX(AggSG,MATCH(TRUE,(AggSGID=$A6),0),8)),ISBLANK(INDEX(AggSG,MATCH(TRUE,(AggSGID=$A6),0),8))),\"\",INDEX(AggSG,MATCH(TRUE,(AggSGID=$A6),0),8)))","v":""},{"$f":"IF($H6=\"\",\"\",INDEX(AggSG,MATCH(TRUE,(AggSGID=$A6),0),9))","v":""},{"$f":"IF($H6=\"\",\"\",INDEX(AggSG,MATCH(TRUE,(AggSGID=$A6),0),10))","v":""},{"$f":"IF($H6=\"\",\"\",INDEX(AggSG,MATCH(TRUE,(AggSGID=$A6),0),11))","v":""},{"$f":"IF($H6=\"\",\"\",INDEX(AggSG,MATCH(TRUE,(AggSGID=$A6),0),12))","v":""},{"$f":"IF($H6=\"\",\"\",INDEX(AggSG,MATCH(TRUE,(AggSGID=$A6),0),13))","v":""},{"$f":"IF($H6=\"\",\"\",INDEX(AggSG,MATCH(TRUE,(AggSGID=$A6),0),26))","v":""},{"$f":"IF($H6=\"\",\"\",INDEX(AggSG,MATCH(TRUE,(AggSGID=$A6),0),27))","v":""},{"$f":"IF($H6=\"\",\"\",INDEX(AggSG,MATCH(TRUE,(AggSGID=$A6),0),28))","v":""},{"$f":"IF($H6=\"\",\"\",INDEX(AggSG,MATCH(TRUE,(AggSGID=$A6),0),29))","v":""}]
[{"$f":"IF(Initial_Info1!B30=\"\",\"\",Initial_Info1!B30)","v":""},{"$f":"IF(Initial_Info1!C30=\"\",\"\",Initial_Info1!C30)","v":0},{"$f":"Initial_Info1!H30&\" \"&Initial_Info1!I30","v":"0 0"},{"$f":"IF(B7=\"\",\"\",100-Initial_Info1!R30)","v":100},{"$f":"IF(B7=\"\",\"\",100-Initial_Info1!S30)","v":100},{"$f":"IF($A7=\"\",\"\",IF(OR(ISNA(INDEX(AggSG,MATCH(TRUE,(AggSGID=$A7),0),6)),ISBLANK(INDEX(AggSG,MATCH(TRUE,(AggSGID=$A7),0),6))),\"\",INDEX(AggSG,MATCH(TRUE,(AggSGID=$A7),0),6)))","v":""},{"$f":"IF($A7=\"\",\"\",IF(OR(ISNA(INDEX(AggSG,MATCH(TRUE,(AggSGID=$A7),0),7)),ISBLANK(INDEX(AggSG,MATCH(TRUE,(AggSGID=$A7),0),7))),\"\",INDEX(AggSG,MATCH(TRUE,(AggSGID=$A7),0),7)))","v":""},{"$f":"IF($A7=\"\",\"\",IF(OR(ISNA(INDEX(AggSG,MATCH(TRUE,(AggSGID=$A7),0),8)),ISBLANK(INDEX(AggSG,MATCH(TRUE,(AggSGID=$A7),0),8))),\"\",INDEX(AggSG,MATCH(TRUE,(AggSGID=$A7),0),8)))","v":""},{"$f":"IF($H7=\"\",\"\",INDEX(AggSG,MATCH(TRUE,(AggSGID=$A7),0),9))","v":""},{"$f":"IF($H7=\"\",\"\",INDEX(AggSG,MATCH(TRUE,(AggSGID=$A7),0),10))","v":""},{"$f":"IF($H7=\"\",\"\",INDEX(AggSG,MATCH(TRUE,(AggSGID=$A7),0),11))","v":""},{"$f":"IF($H7=\"\",\"\",INDEX(AggSG,MATCH(TRUE,(AggSGID=$A7),0),12))","v":""},{"$f":"IF($H7=\"\",\"\",INDEX(AggSG,MATCH(TRUE,(AggSGID=$A7),0),13))","v":""},{"$f":"IF($H7=\"\",\"\",INDEX(AggSG,MATCH(TRUE,(AggSGID=$A7),0),26))","v":""},{"$f":"IF($H7=\"\",\"\",INDEX(AggSG,MATCH(TRUE,(AggSGID=$A7),0),27))","v":""},{"$f":"IF($H7=\"\",\"\",INDEX(AggSG,MATCH(TRUE,(AggSGID=$A7),0),28))","v":""},{"$f":"IF($H7=\"\",\"\",INDEX(AggSG,MATCH(TRUE,(AggSGID=$A7),0),29))","v":""}]
[{"$f":"IF(Initial_Info1!B31=\"\",\"\",Initial_Info1!B31)","v":""},{"$f":"IF(Initial_Info1!C31=\"\",\"\",Initial_Info1!C31)","v":0},{"$f":"Initial_Info1!H31&\" \"&Initial_Info1!I31","v":"0 0"},{"$f":"IF(B8=\"\",\"\",100-Initial_Info1!R31)","v":100},{"$f":"IF(B8=\"\",\"\",100-Initial_Info1!S31)","v":100},{"$f":"IF($A8=\"\",\"\",IF(OR(ISNA(INDEX(AggSG,MATCH(TRUE,(AggSGID=$A8),0),6)),ISBLANK(INDEX(AggSG,MATCH(TRUE,(AggSGID=$A8),0),6))),\"\",INDEX(AggSG,MATCH(TRUE,(AggSGID=$A8),0),6)))","v":""},{"$f":"IF($A8=\"\",\"\",IF(OR(ISNA(INDEX(AggSG,MATCH(TRUE,(AggSGID=$A8),0),7)),ISBLANK(INDEX(AggSG,MATCH(TRUE,(AggSGID=$A8),0),7))),\"\",INDEX(AggSG,MATCH(TRUE,(AggSGID=$A8),0),7)))","v":""},{"$f":"IF($A8=\"\",\"\",IF(OR(ISNA(INDEX(AggSG,MATCH(TRUE,(AggSGID=$A8),0),8)),ISBLANK(INDEX(AggSG,MATCH(TRUE,(AggSGID=$A8),0),8))),\"\",INDEX(AggSG,MATCH(TRUE,(AggSGID=$A8),0),8)))","v":""},{"$f":"IF($H8=\"\",\"\",INDEX(AggSG,MATCH(TRUE,(AggSGID=$A8),0),9))","v":""},{"$f":"IF($H8=\"\",\"\",INDEX(AggSG,MATCH(TRUE,(AggSGID=$A8),0),10))","v":""},{"$f":"IF($H8=\"\",\"\",INDEX(AggSG,MATCH(TRUE,(AggSGID=$A8),0),11))","v":""},{"$f":"IF($H8=\"\",\"\",INDEX(AggSG,MATCH(TRUE,(AggSGID=$A8),0),12))","v":""},{"$f":"IF($H8=\"\",\"\",INDEX(AggSG,MATCH(TRUE,(AggSGID=$A8),0),13))","v":""},{"$f":"IF($H8=\"\",\"\",INDEX(AggSG,MATCH(TRUE,(AggSGID=$A8),0),26))","v":""},{"$f":"IF($H8=\"\",\"\",INDEX(AggSG,MATCH(TRUE,(AggSGID=$A8),0),27))","v":""},{"$f":"IF($H8=\"\",\"\",INDEX(AggSG,MATCH(TRUE,(AggSGID=$A8),0),28))","v":""},{"$f":"IF($H8=\"\",\"\",INDEX(AggSG,MATCH(TRUE,(AggSGID=$A8),0),29))","v":""}]
[{"$f":"IF(Initial_Info1!B32=\"\",\"\",Initial_Info1!B32)","v":""},{"$f":"IF(Initial_Info1!C32=\"\",\"\",Initial_Info1!C32)","v":0},{"$f":"Initial_Info1!H32&\" \"&Initial_Info1!I32","v":"0 0"},{"$f":"IF(B9=\"\",\"\",100-Initial_Info1!R32)","v":100},{"$f":"IF(B9=\"\",\"\",100-Initial_Info1!S32)","v":100},{"$f":"IF($A9=\"\",\"\",IF(OR(ISNA(INDEX(AggSG,MATCH(TRUE,(AggSGID=$A9),0),6)),ISBLANK(INDEX(AggSG,MATCH(TRUE,(AggSGID=$A9),0),6))),\"\",INDEX(AggSG,MATCH(TRUE,(AggSGID=$A9),0),6)))","v":""},{"$f":"IF($A9=\"\",\"\",IF(OR(ISNA(INDEX(AggSG,MATCH(TRUE,(AggSGID=$A9),0),7)),ISBLANK(INDEX(AggSG,MATCH(TRUE,(AggSGID=$A9),0),7))),\"\",INDEX(AggSG,MATCH(TRUE,(AggSGID=$A9),0),7)))","v":""},{"$f":"IF($A9=\"\",\"\",IF(OR(ISNA(INDEX(AggSG,MATCH(TRUE,(AggSGID=$A9),0),8)),ISBLANK(INDEX(AggSG,MATCH(TRUE,(AggSGID=$A9),0),8))),\"\",INDEX(AggSG,MATCH(TRUE,(AggSGID=$A9),0),8)))","v":""},{"$f":"IF($H9=\"\",\"\",INDEX(AggSG,MATCH(TRUE,(AggSGID=$A9),0),9))","v":""},{"$f":"IF($H9=\"\",\"\",INDEX(AggSG,MATCH(TRUE,(AggSGID=$A9),0),10))","v":""},{"$f":"IF($H9=\"\",\"\",INDEX(AggSG,MATCH(TRUE,(AggSGID=$A9),0),11))","v":""},{"$f":"IF($H9=\"\",\"\",INDEX(AggSG,MATCH(TRUE,(AggSGID=$A9),0),12))","v":""},{"$f":"IF($H9=\"\",\"\",INDEX(AggSG,MATCH(TRUE,(AggSGID=$A9),0),13))","v":""},{"$f":"IF($H9=\"\",\"\",INDEX(AggSG,MATCH(TRUE,(AggSGID=$A9),0),26))","v":""},{"$f":"IF($H9=\"\",\"\",INDEX(AggSG,MATCH(TRUE,(AggSGID=$A9),0),27))","v":""},{"$f":"IF($H9=\"\",\"\",INDEX(AggSG,MATCH(TRUE,(AggSGID=$A9),0),28))","v":""},{"$f":"IF($H9=\"\",\"\",INDEX(AggSG,MATCH(TRUE,(AggSGID=$A9),0),29))","v":""}]
[]
[null,null,null,null,null,"Mass Flask & Water","SSD Mass","Mass Flask, Sample & Water","Dry Mass","SSD Vol. of Sample","Apparent Sp.Gr.","SSD Sp.Gr.","Bulk Sp.Gr.","Absorption"]
[null,"AASHTO T 84/ ASTM C128",null,null,null,"W","B","WS","A","V"]
[null,"FOR COMBINED",null,null,null,null,null,null,null,"=W+B-WS","=A/(V-(B-A))","=B/V","=A/V","=((B-A)*100/A"]
["Material ID","Source","Grading","- #4","- #8","(g)","(g)","(g)","(g)","(cm3)",null,null,null,"(%)"]
[{"$f":"IF(Initial_Info1!B28=\"\",\"\",Initial_Info1!B28)","v":""},{"$f":"IF(Initial_Info1!C28=\"\",\"\",Initial_Info1!C28)","v":0},{"$f":"Initial_Info1!H28&\" \"&Initial_Info1!I28","v":"0 0"},{"$f":"IF(B5=\"\",\"\",Initial_Info1!R28)","v":0},{"$f":"IF(B5=\"\",\"\",Initial_Info1!S28)","v":0},{"$f":"IF($A15=\"\",\"\",IF(OR(ISNA(INDEX(AggSG,MATCH(TRUE,(AggSGID=$A15),0),16)),ISBLANK(INDEX(AggSG,MATCH(TRUE,(AggSGID=$A15),0),16))),\"\",INDEX(AggSG,MATCH(TRUE,(AggSGID=$A15),0),16)))","v":""},{"$f":"IF($A15=\"\",\"\",IF(OR(ISNA(INDEX(AggSG,MATCH(TRUE,(AggSGID=$A15),0),17)),ISBLANK(INDEX(AggSG,MATCH(TRUE,(AggSGID=$A15),0),17))),\"\",INDEX(AggSG,MATCH(TRUE,(AggSGID=$A15),0),17)))","v":""},{"$f":"IF($A15=\"\",\"\",IF(OR(ISNA(INDEX(AggSG,MATCH(TRUE,(AggSGID=$A15),0),18)),ISBLANK(INDEX(AggSG,MATCH(TRUE,(AggSGID=$A15),0),18))),\"\",INDEX(AggSG,MATCH(TRUE,(AggSGID=$A15),0),18)))","v":""},{"$f":"IF($A15=\"\",\"\",IF(OR(ISNA(INDEX(AggSG,MATCH(TRUE,(AggSGID=$A15),0),19)),ISBLANK(INDEX(AggSG,MATCH(TRUE,(AggSGID=$A15),0),19))),\"\",INDEX(AggSG,MATCH(TRUE,(AggSGID=$A15),0),19)))","v":""},{"$f":"IF($I15=\"\",\"\",INDEX(AggSG,MATCH(TRUE,(AggSGID=$A15),0),20))","v":""},{"$f":"IF($I15=\"\",\"\",INDEX(AggSG,MATCH(TRUE,(AggSGID=$A15),0),21))","v":""},{"$f":"IF($I15=\"\",\"\",INDEX(AggSG,MATCH(TRUE,(AggSGID=$A15),0),22))","v":""},{"$f":"IF($I15=\"\",\"\",INDEX(AggSG,MATCH(TRUE,(AggSGID=$A15),0),23))","v":""},{"$f":"IF($I15=\"\",\"\",INDEX(AggSG,MATCH(TRUE,(AggSGID=$A15),0),24))","v":""}]
[{"$f":"IF(Initial_Info1!B29=\"\",\"\",Initial_Info1!B29)","v":""},{"$f":"IF(Initial_Info1!C29=\"\",\"\",Initial_Info1!C29)","v":0},{"$f":"Initial_Info1!H29&\" \"&Initial_Info1!I29","v":"0 0"},{"$f":"IF(B6=\"\",\"\",Initial_Info1!R29)","v":0},{"$f":"IF(B6=\"\",\"\",Initial_Info1!S29)","v":0},{"$f":"IF($A16=\"\",\"\",IF(OR(ISNA(INDEX(AggSG,MATCH(TRUE,(AggSGID=$A16),0),16)),ISBLANK(INDEX(AggSG,MATCH(TRUE,(AggSGID=$A16),0),16))),\"\",INDEX(AggSG,MATCH(TRUE,(AggSGID=$A16),0),16)))","v":""},{"$f":"IF($A16=\"\",\"\",IF(OR(ISNA(INDEX(AggSG,MATCH(TRUE,(AggSGID=$A16),0),17)),ISBLANK(INDEX(AggSG,MATCH(TRUE,(AggSGID=$A16),0),17))),\"\",INDEX(AggSG,MATCH(TRUE,(AggSGID=$A16),0),17)))","v":""},{"$f":"IF($A16=\"\",\"\",IF(OR(ISNA(INDEX(AggSG,MATCH(TRUE,(AggSGID=$A16),0),18)),ISBLANK(INDEX(AggSG,MATCH(TRUE,(AggSGID=$A16),0),18))),\"\",INDEX(AggSG,MATCH(TRUE,(AggSGID=$A16),0),18)))","v":""},{"$f":"IF($A16=\"\",\"\",IF(OR(ISNA(INDEX(AggSG,MATCH(TRUE,(AggSGID=$A16),0),19)),ISBLANK(INDEX(AggSG,MATCH(TRUE,(AggSGID=$A16),0),19))),\"\",INDEX(AggSG,MATCH(TRUE,(AggSGID=$A16),0),19)))","v":""},{"$f":"IF($I16=\"\",\"\",INDEX(AggSG,MATCH(TRUE,(AggSGID=$A16),0),20))","v":""},{"$f":"IF($I16=\"\",\"\",INDEX(AggSG,MATCH(TRUE,(AggSGID=$A16),0),21))","v":""},{"$f":"IF($I16=\"\",\"\",INDEX(AggSG,MATCH(TRUE,(AggSGID=$A16),0),22))","v":""},{"$f":"IF($I16=\"\",\"\",INDEX(AggSG,MATCH(TRUE,(AggSGID=$A16),0),23))","v":""},{"$f":"IF($I16=\"\",\"\",INDEX(AggSG,MATCH(TRUE,(AggSGID=$A16),0),24))","v":""}]
[{"$f":"IF(Initial_Info1!B30=\"\",\"\",Initial_Info1!B30)","v":""},{"$f":"IF(Initial_Info1!C30=\"\",\"\",Initial_Info1!C30)","v":0},{"$f":"Initial_Info1!H30&\" \"&Initial_Info1!I30","v":"0 0"},{"$f":"IF(B7=\"\",\"\",Initial_Info1!R30)","v":0},{"$f":"IF(B7=\"\",\"\",Initial_Info1!S30)","v":0},{"$f":"IF($A17=\"\",\"\",IF(OR(ISNA(INDEX(AggSG,MATCH(TRUE,(AggSGID=$A17),0),16)),ISBLANK(INDEX(AggSG,MATCH(TRUE,(AggSGID=$A17),0),16))),\"\",INDEX(AggSG,MATCH(TRUE,(AggSGID=$A17),0),16)))","v":""},{"$f":"IF($A17=\"\",\"\",IF(OR(ISNA(INDEX(AggSG,MATCH(TRUE,(AggSGID=$A17),0),17)),ISBLANK(INDEX(AggSG,MATCH(TRUE,(AggSGID=$A17),0),17))),\"\",INDEX(AggSG,MATCH(TRUE,(AggSGID=$A17),0),17)))","v":""},{"$f":"IF($A17=\"\",\"\",IF(OR(ISNA(INDEX(AggSG,MATCH(TRUE,(AggSGID=$A17),0),18)),ISBLANK(INDEX(AggSG,MATCH(TRUE,(AggSGID=$A17),0),18))),\"\",INDEX(AggSG,MATCH(TRUE,(AggSGID=$A17),0),18)))","v":""},{"$f":"IF($A17=\"\",\"\",IF(OR(ISNA(INDEX(AggSG,MATCH(TRUE,(AggSGID=$A17),0),19)),ISBLANK(INDEX(AggSG,MATCH(TRUE,(AggSGID=$A17),0),19))),\"\",INDEX(AggSG,MATCH(TRUE,(AggSGID=$A17),0),19)))","v":""},{"$f":"IF($I17=\"\",\"\",INDEX(AggSG,MATCH(TRUE,(AggSGID=$A17),0),20))","v":""},{"$f":"IF($I17=\"\",\"\",INDEX(AggSG,MATCH(TRUE,(AggSGID=$A17),0),21))","v":""},{"$f":"IF($I17=\"\",\"\",INDEX(AggSG,MATCH(TRUE,(AggSGID=$A17),0),22))","v":""},{"$f":"IF($I17=\"\",\"\",INDEX(AggSG,MATCH(TRUE,(AggSGID=$A17),0),23))","v":""},{"$f":"IF($I17=\"\",\"\",INDEX(AggSG,MATCH(TRUE,(AggSGID=$A17),0),24))","v":""}]
[{"$f":"IF(Initial_Info1!B31=\"\",\"\",Initial_Info1!B31)","v":""},{"$f":"IF(Initial_Info1!C31=\"\",\"\",Initial_Info1!C31)","v":0},{"$f":"Initial_Info1!H31&\" \"&Initial_Info1!I31","v":"0 0"},{"$f":"IF(B8=\"\",\"\",Initial_Info1!R31)","v":0},{"$f":"IF(B8=\"\",\"\",Initial_Info1!S31)","v":0},{"$f":"IF($A18=\"\",\"\",IF(OR(ISNA(INDEX(AggSG,MATCH(TRUE,(AggSGID=$A18),0),16)),ISBLANK(INDEX(AggSG,MATCH(TRUE,(AggSGID=$A18),0),16))),\"\",INDEX(AggSG,MATCH(TRUE,(AggSGID=$A18),0),16)))","v":""},{"$f":"IF($A18=\"\",\"\",IF(OR(ISNA(INDEX(AggSG,MATCH(TRUE,(AggSGID=$A18),0),17)),ISBLANK(INDEX(AggSG,MATCH(TRUE,(AggSGID=$A18),0),17))),\"\",INDEX(AggSG,MATCH(TRUE,(AggSGID=$A18),0),17)))","v":""},{"$f":"IF($A18=\"\",\"\",IF(OR(ISNA(INDEX(AggSG,MATCH(TRUE,(AggSGID=$A18),0),18)),ISBLANK(INDEX(AggSG,MATCH(TRUE,(AggSGID=$A18),0),18))),\"\",INDEX(AggSG,MATCH(TRUE,(AggSGID=$A18),0),18)))","v":""},{"$f":"IF($A18=\"\",\"\",IF(OR(ISNA(INDEX(AggSG,MATCH(TRUE,(AggSGID=$A18),0),19)),ISBLANK(INDEX(AggSG,MATCH(TRUE,(AggSGID=$A18),0),19))),\"\",INDEX(AggSG,MATCH(TRUE,(AggSGID=$A18),0),19)))","v":""},{"$f":"IF($I18=\"\",\"\",INDEX(AggSG,MATCH(TRUE,(AggSGID=$A18),0),20))","v":""},{"$f":"IF($I18=\"\",\"\",INDEX(AggSG,MATCH(TRUE,(AggSGID=$A18),0),21))","v":""},{"$f":"IF($I18=\"\",\"\",INDEX(AggSG,MATCH(TRUE,(AggSGID=$A18),0),22))","v":""},{"$f":"IF($I18=\"\",\"\",INDEX(AggSG,MATCH(TRUE,(AggSGID=$A18),0),23))","v":""},{"$f":"IF($I18=\"\",\"\",INDEX(AggSG,MATCH(TRUE,(AggSGID=$A18),0),24))","v":""}]
[{"$f":"IF(Initial_Info1!B32=\"\",\"\",Initial_Info1!B32)","v":""},{"$f":"IF(Initial_Info1!C32=\"\",\"\",Initial_Info1!C32)","v":0},{"$f":"Initial_Info1!H32&\" \"&Initial_Info1!I32","v":"0 0"},{"$f":"IF(B9=\"\",\"\",Initial_Info1!R32)","v":0},{"$f":"IF(B9=\"\",\"\",Initial_Info1!S32)","v":0},{"$f":"IF($A19=\"\",\"\",IF(OR(ISNA(INDEX(AggSG,MATCH(TRUE,(AggSGID=$A19),0),16)),ISBLANK(INDEX(AggSG,MATCH(TRUE,(AggSGID=$A19),0),16))),\"\",INDEX(AggSG,MATCH(TRUE,(AggSGID=$A19),0),16)))","v":""},{"$f":"IF($A19=\"\",\"\",IF(OR(ISNA(INDEX(AggSG,MATCH(TRUE,(AggSGID=$A19),0),17)),ISBLANK(INDEX(AggSG,MATCH(TRUE,(AggSGID=$A19),0),17))),\"\",INDEX(AggSG,MATCH(TRUE,(AggSGID=$A19),0),17)))","v":""},{"$f":"IF($A19=\"\",\"\",IF(OR(ISNA(INDEX(AggSG,MATCH(TRUE,(AggSGID=$A19),0),18)),ISBLANK(INDEX(AggSG,MATCH(TRUE,(AggSGID=$A19),0),18))),\"\",INDEX(AggSG,MATCH(TRUE,(AggSGID=$A19),0),18)))","v":""},{"$f":"IF($A19=\"\",\"\",IF(OR(ISNA(INDEX(AggSG,MATCH(TRUE,(AggSGID=$A19),0),19)),ISBLANK(INDEX(AggSG,MATCH(TRUE,(AggSGID=$A19),0),19))),\"\",INDEX(AggSG,MATCH(TRUE,(AggSGID=$A19),0),19)))","v":""},{"$f":"IF($I19=\"\",\"\",INDEX(AggSG,MATCH(TRUE,(AggSGID=$A19),0),20))","v":""},{"$f":"IF($I19=\"\",\"\",INDEX(AggSG,MATCH(TRUE,(AggSGID=$A19),0),21))","v":""},{"$f":"IF($I19=\"\",\"\",INDEX(AggSG,MATCH(TRUE,(AggSGID=$A19),0),22))","v":""},{"$f":"IF($I19=\"\",\"\",INDEX(AggSG,MATCH(TRUE,(AggSGID=$A19),0),23))","v":""},{"$f":"IF($I19=\"\",\"\",INDEX(AggSG,MATCH(TRUE,(AggSGID=$A19),0),24))","v":""}]
[null,"FOR FINE"]
["Material ID","Source","Grading","- #4","- #8","(g)","(g)","(g)","(g)","(cm3)",null,null,null,"(%)"]
[{"$f":"IF(Initial_Info1!B35=\"\",\"\",Initial_Info1!B35)","v":""},{"$f":"IF(Initial_Info1!C35=\"\",\"\",Initial_Info1!C35)","v":0},{"$f":"Initial_Info1!H35&\" \"&Initial_Info1!I35","v":"0 0"},{"$f":"IF(B5=\"\",\"\",Initial_Info1!R35)","v":0},{"$f":"IF(B5=\"\",\"\",Initial_Info1!S35)","v":0},{"$f":"IF($A22=\"\",\"\",IF(OR(ISNA(INDEX(AggSG,MATCH(TRUE,(AggSGID=$A22),0),16)),ISBLANK(INDEX(AggSG,MATCH(TRUE,(AggSGID=$A22),0),16))),\"\",INDEX(AggSG,MATCH(TRUE,(AggSGID=$A22),0),16)))","v":""},{"$f":"IF($A22=\"\",\"\",IF(OR(ISNA(INDEX(AggSG,MATCH(TRUE,(AggSGID=$A22),0),17)),ISBLANK(INDEX(AggSG,MATCH(TRUE,(AggSGID=$A22),0),17))),\"\",INDEX(AggSG,MATCH(TRUE,(AggSGID=$A22),0),17)))","v":""},{"$f":"IF($A22=\"\",\"\",IF(OR(ISNA(INDEX(AggSG,MATCH(TRUE,(AggSGID=$A22),0),18)),ISBLANK(INDEX(AggSG,MATCH(TRUE,(AggSGID=$A22),0),18))),\"\",INDEX(AggSG,MATCH(TRUE,(AggSGID=$A22),0),18)))","v":""},{"$f":"IF($A22=\"\",\"\",IF(OR(ISNA(INDEX(AggSG,MATCH(TRUE,(AggSGID=$A22),0),19)),ISBLANK(INDEX(AggSG,MATCH(TRUE,(AggSGID=$A22),0),19))),\"\",INDEX(AggSG,MATCH(TRUE,(AggSGID=$A22),0),19)))","v":""},{"$f":"IF($I22=\"\",\"\",INDEX(AggSG,MATCH(TRUE,(AggSGID=$A22),0),20))","v":""},{"$f":"IF($I22=\"\",\"\",INDEX(AggSG,MATCH(TRUE,(AggSGID=$A22),0),21))","v":""},{"$f":"IF($I22=\"\",\"\",INDEX(AggSG,MATCH(TRUE,(AggSGID=$A22),0),22))","v":""},{"$f":"IF($I22=\"\",\"\",INDEX(AggSG,MATCH(TRUE,(AggSGID=$A22),0),23))","v":""},{"$f":"IF($I22=\"\",\"\",INDEX(AggSG,MATCH(TRUE,(AggSGID=$A22),0),24))","v":""}]
[{"$f":"IF(Initial_Info1!B36=\"\",\"\",Initial_Info1!B36)","v":""},{"$f":"IF(Initial_Info1!C36=\"\",\"\",Initial_Info1!C36)","v":0},{"$f":"Initial_Info1!H36&\" \"&Initial_Info1!I36","v":"0 0"},{"$f":"IF(B6=\"\",\"\",Initial_Info1!R36)","v":0},{"$f":"IF(B6=\"\",\"\",Initial_Info1!S36)","v":0},{"$f":"IF($A23=\"\",\"\",IF(OR(ISNA(INDEX(AggSG,MATCH(TRUE,(AggSGID=$A23),0),16)),ISBLANK(INDEX(AggSG,MATCH(TRUE,(AggSGID=$A23),0),16))),\"\",INDEX(AggSG,MATCH(TRUE,(AggSGID=$A23),0),16)))","v":""},{"$f":"IF($A23=\"\",\"\",IF(OR(ISNA(INDEX(AggSG,MATCH(TRUE,(AggSGID=$A23),0),17)),ISBLANK(INDEX(AggSG,MATCH(TRUE,(AggSGID=$A23),0),17))),\"\",INDEX(AggSG,MATCH(TRUE,(AggSGID=$A23),0),17)))","v":""},{"$f":"IF($A23=\"\",\"\",IF(OR(ISNA(INDEX(AggSG,MATCH(TRUE,(AggSGID=$A23),0),18)),ISBLANK(INDEX(AggSG,MATCH(TRUE,(AggSGID=$A23),0),18))),\"\",INDEX(AggSG,MATCH(TRUE,(AggSGID=$A23),0),18)))","v":""},{"$f":"IF($A23=\"\",\"\",IF(OR(ISNA(INDEX(AggSG,MATCH(TRUE,(AggSGID=$A23),0),19)),ISBLANK(INDEX(AggSG,MATCH(TRUE,(AggSGID=$A23),0),19))),\"\",INDEX(AggSG,MATCH(TRUE,(AggSGID=$A23),0),19)))","v":""},{"$f":"IF($I23=\"\",\"\",INDEX(AggSG,MATCH(TRUE,(AggSGID=$A23),0),20))","v":""},{"$f":"IF($I23=\"\",\"\",INDEX(AggSG,MATCH(TRUE,(AggSGID=$A23),0),21))","v":""},{"$f":"IF($I23=\"\",\"\",INDEX(AggSG,MATCH(TRUE,(AggSGID=$A23),0),22))","v":""},{"$f":"IF($I23=\"\",\"\",INDEX(AggSG,MATCH(TRUE,(AggSGID=$A23),0),23))","v":""},{"$f":"IF($I23=\"\",\"\",INDEX(AggSG,MATCH(TRUE,(AggSGID=$A23),0),24))","v":""}]
[{"$f":"IF(Initial_Info1!B37=\"\",\"\",Initial_Info1!B37)","v":""},{"$f":"IF(Initial_Info1!C37=\"\",\"\",Initial_Info1!C37)","v":0},{"$f":"Initial_Info1!H37&\" \"&Initial_Info1!I37","v":"0 0"},{"$f":"IF(B7=\"\",\"\",Initial_Info1!R37)","v":0},{"$f":"IF(B7=\"\",\"\",Initial_Info1!S37)","v":0},{"$f":"IF($A24=\"\",\"\",IF(OR(ISNA(INDEX(AggSG,MATCH(TRUE,(AggSGID=$A24),0),16)),ISBLANK(INDEX(AggSG,MATCH(TRUE,(AggSGID=$A24),0),16))),\"\",INDEX(AggSG,MATCH(TRUE,(AggSGID=$A24),0),16)))","v":""},{"$f":"IF($A24=\"\",\"\",IF(OR(ISNA(INDEX(AggSG,MATCH(TRUE,(AggSGID=$A24),0),17)),ISBLANK(INDEX(AggSG,MATCH(TRUE,(AggSGID=$A24),0),17))),\"\",INDEX(AggSG,MATCH(TRUE,(AggSGID=$A24),0),17)))","v":""},{"$f":"IF($A24=\"\",\"\",IF(OR(ISNA(INDEX(AggSG,MATCH(TRUE,(AggSGID=$A24),0),18)),ISBLANK(INDEX(AggSG,MATCH(TRUE,(AggSGID=$A24),0),18))),\"\",INDEX(AggSG,MATCH(TRUE,(AggSGID=$A24),0),18)))","v":""},{"$f":"IF($A24=\"\",\"\",IF(OR(ISNA(INDEX(AggSG,MATCH(TRUE,(AggSGID=$A24),0),19)),ISBLANK(INDEX(AggSG,MATCH(TRUE,(AggSGID=$A24),0),19))),\"\",INDEX(AggSG,MATCH(TRUE,(AggSGID=$A24),0),19)))","v":""},{"$f":"IF($I24=\"\",\"\",INDEX(AggSG,MATCH(TRUE,(AggSGID=$A24),0),20))","v":""},{"$f":"IF($I24=\"\",\"\",INDEX(AggSG,MATCH(TRUE,(AggSGID=$A24),0),21))","v":""},{"$f":"IF($I24=\"\",\"\",INDEX(AggSG,MATCH(TRUE,(AggSGID=$A24),0),22))","v":""},{"$f":"IF($I24=\"\",\"\",INDEX(AggSG,MATCH(TRUE,(AggSGID=$A24),0),23))","v":""},{"$f":"IF($I24=\"\",\"\",INDEX(AggSG,MATCH(TRUE,(AggSGID=$A24),0),24))","v":""}]
[{"$f":"IF(Initial_Info1!B38=\"\",\"\",Initial_Info1!B38)","v":""},{"$f":"IF(Initial_Info1!C38=\"\",\"\",Initial_Info1!C38)","v":0},{"$f":"Initial_Info1!H38&\" \"&Initial_Info1!I38","v":"0 0"},{"$f":"IF(B8=\"\",\"\",Initial_Info1!R38)","v":0},{"$f":"IF(B8=\"\",\"\",Initial_Info1!S38)","v":0},{"$f":"IF($A25=\"\",\"\",IF(OR(ISNA(INDEX(AggSG,MATCH(TRUE,(AggSGID=$A25),0),16)),ISBLANK(INDEX(AggSG,MATCH(TRUE,(AggSGID=$A25),0),16))),\"\",INDEX(AggSG,MATCH(TRUE,(AggSGID=$A25),0),16)))","v":""},{"$f":"IF($A25=\"\",\"\",IF(OR(ISNA(INDEX(AggSG,MATCH(TRUE,(AggSGID=$A25),0),17)),ISBLANK(INDEX(AggSG,MATCH(TRUE,(AggSGID=$A25),0),17))),\"\",INDEX(AggSG,MATCH(TRUE,(AggSGID=$A25),0),17)))","v":""},{"$f":"IF($A25=\"\",\"\",IF(OR(ISNA(INDEX(AggSG,MATCH(TRUE,(AggSGID=$A25),0),18)),ISBLANK(INDEX(AggSG,MATCH(TRUE,(AggSGID=$A25),0),18))),\"\",INDEX(AggSG,MATCH(TRUE,(AggSGID=$A25),0),18)))","v":""},{"$f":"IF($A25=\"\",\"\",IF(OR(ISNA(INDEX(AggSG,MATCH(TRUE,(AggSGID=$A25),0),19)),ISBLANK(INDEX(AggSG,MATCH(TRUE,(AggSGID=$A25),0),19))),\"\",INDEX(AggSG,MATCH(TRUE,(AggSGID=$A25),0),19)))","v":""},{"$f":"IF($I25=\"\",\"\",INDEX(AggSG,MATCH(TRUE,(AggSGID=$A25),0),20))","v":""},{"$f":"IF($I25=\"\",\"\",INDEX(AggSG,MATCH(TRUE,(AggSGID=$A25),0),21))","v":""},{"$f":"IF($I25=\"\",\"\",INDEX(AggSG,MATCH(TRUE,(AggSGID=$A25),0),22))","v":""},{"$f":"IF($I25=\"\",\"\",INDEX(AggSG,MATCH(TRUE,(AggSGID=$A25),0),23))","v":""},{"$f":"IF($I25=\"\",\"\",INDEX(AggSG,MATCH(TRUE,(AggSGID=$A25),0),24))","v":""}]
[{"$f":"IF(Initial_Info1!B39=\"\",\"\",Initial_Info1!B39)","v":""},{"$f":"IF(Initial_Info1!C39=\"\",\"\",Initial_Info1!C39)","v":0},{"$f":"Initial_Info1!H39&\" \"&Initial_Info1!I39","v":"0 0"},{"$f":"IF(B9=\"\",\"\",Initial_Info1!R39)","v":0},{"$f":"IF(B9=\"\",\"\",Initial_Info1!S39)","v":0},{"$f":"IF($A26=\"\",\"\",IF(OR(ISNA(INDEX(AggSG,MATCH(TRUE,(AggSGID=$A26),0),16)),ISBLANK(INDEX(AggSG,MATCH(TRUE,(AggSGID=$A26),0),16))),\"\",INDEX(AggSG,MATCH(TRUE,(AggSGID=$A26),0),16)))","v":""},{"$f":"IF($A26=\"\",\"\",IF(OR(ISNA(INDEX(AggSG,MATCH(TRUE,(AggSGID=$A26),0),17)),ISBLANK(INDEX(AggSG,MATCH(TRUE,(AggSGID=$A26),0),17))),\"\",INDEX(AggSG,MATCH(TRUE,(AggSGID=$A26),0),17)))","v":""},{"$f":"IF($A26=\"\",\"\",IF(OR(ISNA(INDEX(AggSG,MATCH(TRUE,(AggSGID=$A26),0),18)),ISBLANK(INDEX(AggSG,MATCH(TRUE,(AggSGID=$A26),0),18))),\"\",INDEX(AggSG,MATCH(TRUE,(AggSGID=$A26),0),18)))","v":""},{"$f":"IF($A26=\"\",\"\",IF(OR(ISNA(INDEX(AggSG,MATCH(TRUE,(AggSGID=$A26),0),19)),ISBLANK(INDEX(AggSG,MATCH(TRUE,(AggSGID=$A26),0),19))),\"\",INDEX(AggSG,MATCH(TRUE,(AggSGID=$A26),0),19)))","v":""},{"$f":"IF($I26=\"\",\"\",INDEX(AggSG,MATCH(TRUE,(AggSGID=$A26),0),20))","v":""},{"$f":"IF($I26=\"\",\"\",INDEX(AggSG,MATCH(TRUE,(AggSGID=$A26),0),21))","v":""},{"$f":"IF($I26=\"\",\"\",INDEX(AggSG,MATCH(TRUE,(AggSGID=$A26),0),22))","v":""},{"$f":"IF($I26=\"\",\"\",INDEX(AggSG,MATCH(TRUE,(AggSGID=$A26),0),23))","v":""},{"$f":"IF($I26=\"\",\"\",INDEX(AggSG,MATCH(TRUE,(AggSGID=$A26),0),24))","v":""}]
[]
[null,null,null,null,"PLASTICITY INDEX AASHTO T 89 & T 90"]
[null,null,null,null,"Does Not","Blows","Correction","Can Mass","Wet Mass","Dry Mass","Dry Mass","Moisture","Limit","PI",null,null,null,22,1.0169999999999999]
[null,null,null,null,"Roll",null,null,null,"+ Can","+ Can",null,null,"(LL Blow Corr.)",null,null,null,null,23,1.0109999999999999]
["Material ID","Source","Grading",null,null,null,null,"(g)","(g)","(g)","(g)","(%)",null,null,null,null,null,24,1.0049999999999999]
[{"$f":"IF(Initial_Info1!B28=\"\",\"\",Initial_Info1!B28)","v":""},{"$f":"Initial_Info1!C28","v":0},{"$f":"Initial_Info1!I28","v":0},"LL",null,{"$f":"IF($A32=\"\",\"\",IF(OR(ISNA(INDEX(AggPI,MATCH(TRUE,(AggPIID=$A32),0),5)),ISBLANK(INDEX(AggPI,MATCH(TRUE,(AggPIID=$A32),0),5))),\"\",INDEX(AggPI,MATCH(TRUE,(AggPIID=$A32),0),5)))","v":""},{"$f":"IF(F32=\"\",\"\",VLOOKUP(F32,$R$29:$S$35,2,FALSE))","v":""},{"$f":"IF($A32=\"\",\"\",IF(OR(ISNA(INDEX(AggPI,MATCH(TRUE,(AggPIID=$A32),0),7)),ISBLANK(INDEX(AggPI,MATCH(TRUE,(AggPIID=$A32),0),7))),\"\",INDEX(AggPI,MATCH(TRUE,(AggPIID=$A32),0),7)))","v":""},{"$f":"IF($A32=\"\",\"\",IF(OR(ISNA(INDEX(AggPI,MATCH(TRUE,(AggPIID=$A32),0),8)),ISBLANK(INDEX(AggPI,MATCH(TRUE,(AggPIID=$A32),0),8))),\"\",INDEX(AggPI,MATCH(TRUE,(AggPIID=$A32),0),8)))","v":""},{"$f":"IF($A32=\"\",\"\",IF(OR(ISNA(INDEX(AggPI,MATCH(TRUE,(AggPIID=$A32),0),9)),ISBLANK(INDEX(AggPI,MATCH(TRUE,(AggPIID=$A32),0),9))),\"\",INDEX(AggPI,MATCH(TRUE,(AggPIID=$A32),0),9)))","v":""},{"$f":"IF(H32=\"\",\"\",J32-H32)","v":""},{"$f":"IF(K32=\"\",\"\",ROUND((I32-J32)/K32*100,1))","v":""},{"$f":"IF(L32=\"\",\"\",ROUND(L32*G32,0))","v":""},{"$f":"IF(E33=TRUE,\"Non-Plastic\",IF(OR(M32=\"\",M33=\"\"),\"\",(ROUND(M32-M33,0))))","v":""},null,null,null,25,1]
[{"$f":"Initial_Info1!B20","v":0},{"$f":"Initial_Info1!C20","v":"INNOPHOS, INC."},{"$f":"Initial_Info1!D20","v":"CRANBURY, NJ"},"PL",{"$f":"IF($A32=\"\",FALSE,IF(ISNA(INDEX(AggPI,MATCH(TRUE,(AggPIID=$A32),0),14)),FALSE,INDEX(AggPI,MATCH(TRUE,(AggPIID=$A32),0),14)))","v":false},null,null,{"$f":"IF($A32=\"\",\"\",IF(OR(ISNA(INDEX(AggPI,MATCH(TRUE,(AggPIID=$A32),0),7)),ISBLANK(INDEX(AggPI,MATCH(TRUE,(AggPIID=$A32),0),7))),\"\",INDEX(AggPI,MATCH(TRUE,(AggPIID=$A32),0),15)))","v":""},{"$f":"IF($A32=\"\",\"\",IF(OR(ISNA(INDEX(AggPI,MATCH(TRUE,(AggPIID=$A32),0),16)),ISBLANK(INDEX(AggPI,MATCH(TRUE,(AggPIID=$A32),0),16))),\"\",INDEX(AggPI,MATCH(TRUE,(AggPIID=$A32),0),16)))","v":""},{"$f":"IF($A32=\"\",\"\",IF(OR(ISNA(INDEX(AggPI,MATCH(TRUE,(AggPIID=$A32),0),17)),ISBLANK(INDEX(AggPI,MATCH(TRUE,(AggPIID=$A32),0),17))),\"\",INDEX(AggPI,MATCH(TRUE,(AggPIID=$A32),0),17)))","v":""},{"$f":"IF(H33=\"\",\"\",J33-H33)","v":""},{"$f":"IF(K33=\"\",\"\",ROUND((I33-J33)/K33*100,1))","v":""},{"$f":"IF(L33=\"\",\"\",ROUND(L33,0))","v":""},{"$f":"IF(O17=TRUE,\"Non-Plastic\",IF(OR(N30=\"\",O30=\"\"),\"\",(ROUND(N30-O30,0))))","v":""},null,null,null,26,0.995]
[{"$f":"IF(Initial_Info1!B29=\"\",\"\",Initial_Info1!B29)","v":""},{"$f":"Initial_Info1!C29","v":0},{"$f":"Initial_Info1!I29","v":0},"LL",null,{"$f":"IF($A34=\"\",\"\",IF(OR(ISNA(INDEX(AggPI,MATCH(TRUE,(AggPIID=$A34),0),5)),ISBLANK(INDEX(AggPI,MATCH(TRUE,(AggPIID=$A34),0),5))),\"\",INDEX(AggPI,MATCH(TRUE,(AggPIID=$A34),0),5)))","v":""},{"$f":"IF(F34=\"\",\"\",VLOOKUP(F34,$R$29:$S$35,2,FALSE))","v":""},{"$f":"IF($A34=\"\",\"\",IF(OR(ISNA(INDEX(AggPI,MATCH(TRUE,(AggPIID=$A34),0),7)),ISBLANK(INDEX(AggPI,MATCH(TRUE,(AggPIID=$A34),0),7))),\"\",INDEX(AggPI,MATCH(TRUE,(AggPIID=$A34),0),7)))","v":""},{"$f":"IF($A34=\"\",\"\",IF(OR(ISNA(INDEX(AggPI,MATCH(TRUE,(AggPIID=$A34),0),8)),ISBLANK(INDEX(AggPI,MATCH(TRUE,(AggPIID=$A34),0),8))),\"\",INDEX(AggPI,MATCH(TRUE,(AggPIID=$A34),0),8)))","v":""},{"$f":"IF($A34=\"\",\"\",IF(OR(ISNA(INDEX(AggPI,MATCH(TRUE,(AggPIID=$A34),0),9)),ISBLANK(INDEX(AggPI,MATCH(TRUE,(AggPIID=$A34),0),9))),\"\",INDEX(AggPI,MATCH(TRUE,(AggPIID=$A34),0),9)))","v":""},{"$f":"IF(H34=\"\",\"\",J34-H34)","v":""},{"$f":"IF(K34=\"\",\"\",ROUND((I34-J34)/K34*100,1))","v":""},{"$f":"IF(L34=\"\",\"\",ROUND(L34*G34,0))","v":""},{"$f":"IF(E35=TRUE,\"Non-Plastic\",IF(OR(M34=\"\",M35=\"\"),\"\",(ROUND(M34-M35,0))))","v":""},null,null,null,27,0.99]
[{"$f":"Initial_Info1!B22","v":"AGGREGATE ADDITIVES (Fibers)"},{"$f":"Initial_Info1!C10","v":0},{"$f":"Initial_Info1!D10","v":0},"PL",{"$f":"IF($A34=\"\",FALSE,IF(ISNA(INDEX(AggPI,MATCH(TRUE,(AggPIID=$A34),0),14)),FALSE,INDEX(AggPI,MATCH(TRUE,(AggPIID=$A34),0),14)))","v":false},null,null,{"$f":"IF($A34=\"\",\"\",IF(OR(ISNA(INDEX(AggPI,MATCH(TRUE,(AggPIID=$A34),0),7)),ISBLANK(INDEX(AggPI,MATCH(TRUE,(AggPIID=$A34),0),7))),\"\",INDEX(AggPI,MATCH(TRUE,(AggPIID=$A34),0),15)))","v":""},{"$f":"IF($A34=\"\",\"\",IF(OR(ISNA(INDEX(AggPI,MATCH(TRUE,(AggPIID=$A34),0),16)),ISBLANK(INDEX(AggPI,MATCH(TRUE,(AggPIID=$A34),0),16))),\"\",INDEX(AggPI,MATCH(TRUE,(AggPIID=$A34),0),16)))","v":""},{"$f":"IF($A34=\"\",\"\",IF(OR(ISNA(INDEX(AggPI,MATCH(TRUE,(AggPIID=$A34),0),17)),ISBLANK(INDEX(AggPI,MATCH(TRUE,(AggPIID=$A34),0),17))),\"\",INDEX(AggPI,MATCH(TRUE,(AggPIID=$A34),0),17)))","v":""},"","",{"$f":"IF(L35=\"\",\"\",ROUND(L35,0))","v":""},{"$f":"IF(O19=TRUE,\"Non-Plastic\",IF(OR(N32=\"\",O32=\"\"),\"\",(ROUND(N32-O32,0))))","v":""},null,null,null,28,0.98499999999999999]
[{"$f":"IF(Initial_Info1!B30=\"\",\"\",Initial_Info1!B30)","v":""},{"$f":"Initial_Info1!C30","v":0},{"$f":"Initial_Info1!I30","v":0},"LL",null,{"$f":"IF($A36=\"\",\"\",IF(OR(ISNA(INDEX(AggPI,MATCH(TRUE,(AggPIID=$A36),0),5)),ISBLANK(INDEX(AggPI,MATCH(TRUE,(AggPIID=$A36),0),5))),\"\",INDEX(AggPI,MATCH(TRUE,(AggPIID=$A36),0),5)))","v":""},{"$f":"IF(F36=\"\",\"\",VLOOKUP(F36,$R$29:$S$35,2,FALSE))","v":""},{"$f":"IF($A36=\"\",\"\",IF(OR(ISNA(INDEX(AggPI,MATCH(TRUE,(AggPIID=$A36),0),7)),ISBLANK(INDEX(AggPI,MATCH(TRUE,(AggPIID=$A36),0),7))),\"\",INDEX(AggPI,MATCH(TRUE,(AggPIID=$A36),0),7)))","v":""},{"$f":"IF($A36=\"\",\"\",IF(OR(ISNA(INDEX(AggPI,MATCH(TRUE,(AggPIID=$A36),0),8)),ISBLANK(INDEX(AggPI,MATCH(TRUE,(AggPIID=$A36),0),8))),\"\",INDEX(AggPI,MATCH(TRUE,(AggPIID=$A36),0),8)))","v":""},{"$f":"IF($A36=\"\",\"\",IF(OR(ISNA(INDEX(AggPI,MATCH(TRUE,(AggPIID=$A36),0),9)),ISBLANK(INDEX(AggPI,MATCH(TRUE,(AggPIID=$A36),0),9))),\"\",INDEX(AggPI,MATCH(TRUE,(AggPIID=$A36),0),9)))","v":""},"","",{"$f":"IF(L36=\"\",\"\",ROUND(L36*G36,0))","v":""},{"$f":"IF(E37=TRUE,\"Non-Plastic\",IF(OR(M36=\"\",M37=\"\"),\"\",(ROUND(M36-M37,0))))","v":""}]
[{"$f":"Initial_Info1!B24","v":0},{"$f":"Initial_Info1!C12","v":"HERZOG"},{"$f":"Initial_Info1!D12","v":"ELWOOD, KS"},"PL",{"$f":"IF($A36=\"\",FALSE,IF(ISNA(INDEX(AggPI,MATCH(TRUE,(AggPIID=$A36),0),14)),FALSE,INDEX(AggPI,MATCH(TRUE,(AggPIID=$A36),0),14)))","v":false},null,null,{"$f":"IF($A36=\"\",\"\",IF(OR(ISNA(INDEX(AggPI,MATCH(TRUE,(AggPIID=$A36),0),7)),ISBLANK(INDEX(AggPI,MATCH(TRUE,(AggPIID=$A36),0),7))),\"\",INDEX(AggPI,MATCH(TRUE,(AggPIID=$A36),0),15)))","v":""},{"$f":"IF($A36=\"\",\"\",IF(OR(ISNA(INDEX(AggPI,MATCH(TRUE,(AggPIID=$A36),0),16)),ISBLANK(INDEX(AggPI,MATCH(TRUE,(AggPIID=$A36),0),16))),\"\",INDEX(AggPI,MATCH(TRUE,(AggPIID=$A36),0),16)))","v":""},{"$f":"IF($A36=\"\",\"\",IF(OR(ISNA(INDEX(AggPI,MATCH(TRUE,(AggPIID=$A36),0),17)),ISBLANK(INDEX(AggPI,MATCH(TRUE,(AggPIID=$A36),0),17))),\"\",INDEX(AggPI,MATCH(TRUE,(AggPIID=$A36),0),17)))","v":""},"","",{"$f":"IF(L37=\"\",\"\",ROUND(L37,0))","v":""},{"$f":"IF(#REF!=TRUE,\"Non-Plastic\",IF(OR(N34=\"\",O34=\"\"),\"\",(ROUND(N34-O34,0))))","v":{"$error":"#REF!"}}]
[{"$f":"IF(Initial_Info1!B31=\"\",\"\",Initial_Info1!B31)","v":""},{"$f":"Initial_Info1!C31","v":0},{"$f":"Initial_Info1!I31","v":0},"LL",null,{"$f":"IF($A38=\"\",\"\",IF(OR(ISNA(INDEX(AggPI,MATCH(TRUE,(AggPIID=$A38),0),5)),ISBLANK(INDEX(AggPI,MATCH(TRUE,(AggPIID=$A38),0),5))),\"\",INDEX(AggPI,MATCH(TRUE,(AggPIID=$A38),0),5)))","v":""},{"$f":"IF(F38=\"\",\"\",VLOOKUP(F38,$R$29:$S$35,2,FALSE))","v":""},{"$f":"IF($A38=\"\",\"\",IF(OR(ISNA(INDEX(AggPI,MATCH(TRUE,(AggPIID=$A38),0),7)),ISBLANK(INDEX(AggPI,MATCH(TRUE,(AggPIID=$A38),0),7))),\"\",INDEX(AggPI,MATCH(TRUE,(AggPIID=$A38),0),7)))","v":""},{"$f":"IF($A38=\"\",\"\",IF(OR(ISNA(INDEX(AggPI,MATCH(TRUE,(AggPIID=$A38),0),8)),ISBLANK(INDEX(AggPI,MATCH(TRUE,(AggPIID=$A38),0),8))),\"\",INDEX(AggPI,MATCH(TRUE,(AggPIID=$A38),0),8)))","v":""},{"$f":"IF($A38=\"\",\"\",IF(OR(ISNA(INDEX(AggPI,MATCH(TRUE,(AggPIID=$A38),0),9)),ISBLANK(INDEX(AggPI,MATCH(TRUE,(AggPIID=$A38),0),9))),\"\",INDEX(AggPI,MATCH(TRUE,(AggPIID=$A38),0),9)))","v":""},"","",{"$f":"IF(L38=\"\",\"\",ROUND(L38*G38,0))","v":""},{"$f":"IF(E39=TRUE,\"Non-Plastic\",IF(OR(M38=\"\",M39=\"\"),\"\",(ROUND(M38-M39,0))))","v":""}]
[{"$f":"Initial_Info1!B26","v":"COARSE AGGREGATE"},{"$f":"Initial_Info1!C14","v":0},{"$f":"Initial_Info1!D14","v":"Compaction Temperature (°F)"},"PL",{"$f":"IF($A38=\"\",FALSE,IF(ISNA(INDEX(AggPI,MATCH(TRUE,(AggPIID=$A38),0),14)),FALSE,INDEX(AggPI,MATCH(TRUE,(AggPIID=$A38),0),14)))","v":false},null,null,{"$f":"IF($A38=\"\",\"\",IF(OR(ISNA(INDEX(AggPI,MATCH(TRUE,(AggPIID=$A38),0),7)),ISBLANK(INDEX(AggPI,MATCH(TRUE,(AggPIID=$A38),0),7))),\"\",INDEX(AggPI,MATCH(TRUE,(AggPIID=$A38),0),15)))","v":""},{"$f":"IF($A38=\"\",\"\",IF(OR(ISNA(INDEX(AggPI,MATCH(TRUE,(AggPIID=$A38),0),16)),ISBLANK(INDEX(AggPI,MATCH(TRUE,(AggPIID=$A38),0),16))),\"\",INDEX(AggPI,MATCH(TRUE,(AggPIID=$A38),0),16)))","v":""},{"$f":"IF($A38=\"\",\"\",IF(OR(ISNA(INDEX(AggPI,MATCH(TRUE,(AggPIID=$A38),0),17)),ISBLANK(INDEX(AggPI,MATCH(TRUE,(AggPIID=$A38),0),17))),\"\",INDEX(AggPI,MATCH(TRUE,(AggPIID=$A38),0),17)))","v":""},"","",{"$f":"IF(L39=\"\",\"\",ROUND(L39,0))","v":""},{"$f":"IF(#REF!=TRUE,\"Non-Plastic\",IF(OR(N36=\"\",O36=\"\"),\"\",(ROUND(N36-O36,0))))","v":{"$error":"#REF!"}}]
[{"$f":"IF(Initial_Info1!B32=\"\",\"\",Initial_Info1!B32)","v":""},{"$f":"Initial_Info1!C32","v":0},{"$f":"Initial_Info1!I32","v":0},"LL",null,{"$f":"IF($A40=\"\",\"\",IF(OR(ISNA(INDEX(AggPI,MATCH(TRUE,(AggPIID=$A40),0),5)),ISBLANK(INDEX(AggPI,MATCH(TRUE,(AggPIID=$A40),0),5))),\"\",INDEX(AggPI,MATCH(TRUE,(AggPIID=$A40),0),5)))","v":""},{"$f":"IF(F40=\"\",\"\",VLOOKUP(F40,$R$29:$S$35,2,FALSE))","v":""},{"$f":"IF($A40=\"\",\"\",IF(OR(ISNA(INDEX(AggPI,MATCH(TRUE,(AggPIID=$A40),0),7)),ISBLANK(INDEX(AggPI,MATCH(TRUE,(AggPIID=$A40),0),7))),\"\",INDEX(AggPI,MATCH(TRUE,(AggPIID=$A40),0),7)))","v":""},{"$f":"IF($A40=\"\",\"\",IF(OR(ISNA(INDEX(AggPI,MATCH(TRUE,(AggPIID=$A40),0),8)),ISBLANK(INDEX(AggPI,MATCH(TRUE,(AggPIID=$A40),0),8))),\"\",INDEX(AggPI,MATCH(TRUE,(AggPIID=$A40),0),8)))","v":""},{"$f":"IF($A40=\"\",\"\",IF(OR(ISNA(INDEX(AggPI,MATCH(TRUE,(AggPIID=$A40),0),9)),ISBLANK(INDEX(AggPI,MATCH(TRUE,(AggPIID=$A40),0),9))),\"\",INDEX(AggPI,MATCH(TRUE,(AggPIID=$A40),0),9)))","v":""},"","",{"$f":"IF(L40=\"\",\"\",ROUND(L40*G40,0))","v":""},{"$f":"IF(E41=TRUE,\"Non-Plastic\",IF(OR(M40=\"\",M41=\"\"),\"\",(ROUND(M40-M41,0))))","v":""}]
[{"$f":"Initial_Info1!B28","v":0},{"$f":"Initial_Info1!C51","v":0},{"$f":"Initial_Info1!D51","v":0},"PL",{"$f":"IF($A40=\"\",FALSE,IF(ISNA(INDEX(AggPI,MATCH(TRUE,(AggPIID=$A40),0),14)),FALSE,INDEX(AggPI,MATCH(TRUE,(AggPIID=$A40),0),14)))","v":false},null,null,{"$f":"IF($A40=\"\",\"\",IF(OR(ISNA(INDEX(AggPI,MATCH(TRUE,(AggPIID=$A40),0),7)),ISBLANK(INDEX(AggPI,MATCH(TRUE,(AggPIID=$A40),0),7))),\"\",INDEX(AggPI,MATCH(TRUE,(AggPIID=$A40),0),15)))","v":""},{"$f":"IF($A40=\"\",\"\",IF(OR(ISNA(INDEX(AggPI,MATCH(TRUE,(AggPIID=$A40),0),16)),ISBLANK(INDEX(AggPI,MATCH(TRUE,(AggPIID=$A40),0),16))),\"\",INDEX(AggPI,MATCH(TRUE,(AggPIID=$A40),0),16)))","v":""},{"$f":"IF($A40=\"\",\"\",IF(OR(ISNA(INDEX(AggPI,MATCH(TRUE,(AggPIID=$A40),0),17)),ISBLANK(INDEX(AggPI,MATCH(TRUE,(AggPIID=$A40),0),17))),\"\",INDEX(AggPI,MATCH(TRUE,(AggPIID=$A40),0),17)))","v":""},"","",{"$f":"IF(L41=\"\",\"\",ROUND(L41,0))","v":""},{"$f":"IF(O22=TRUE,\"Non-Plastic\",IF(OR(N38=\"\",O38=\"\"),\"\",(ROUND(N38-O38,0))))","v":""}]
[{"$f":"IF(Initial_Info1!B35=\"\",\"\",Initial_Info1!B35)","v":""},{"$f":"Initial_Info1!C35","v":0},{"$f":"Initial_Info1!I35","v":0},"LL",null,{"$f":"IF($A42=\"\",\"\",IF(OR(ISNA(INDEX(AggPI,MATCH(TRUE,(AggPIID=$A42),0),5)),ISBLANK(INDEX(AggPI,MATCH(TRUE,(AggPIID=$A42),0),5))),\"\",INDEX(AggPI,MATCH(TRUE,(AggPIID=$A42),0),5)))","v":""},{"$f":"IF(F42=\"\",\"\",VLOOKUP(F42,$R$29:$S$35,2,FALSE))","v":""},{"$f":"IF($A42=\"\",\"\",IF(OR(ISNA(INDEX(AggPI,MATCH(TRUE,(AggPIID=$A42),0),7)),ISBLANK(INDEX(AggPI,MATCH(TRUE,(AggPIID=$A42),0),7))),\"\",INDEX(AggPI,MATCH(TRUE,(AggPIID=$A42),0),7)))","v":""},{"$f":"IF($A42=\"\",\"\",IF(OR(ISNA(INDEX(AggPI,MATCH(TRUE,(AggPIID=$A42),0),8)),ISBLANK(INDEX(AggPI,MATCH(TRUE,(AggPIID=$A42),0),8))),\"\",INDEX(AggPI,MATCH(TRUE,(AggPIID=$A42),0),8)))","v":""},{"$f":"IF($A42=\"\",\"\",IF(OR(ISNA(INDEX(AggPI,MATCH(TRUE,(AggPIID=$A42),0),9)),ISBLANK(INDEX(AggPI,MATCH(TRUE,(AggPIID=$A42),0),9))),\"\",INDEX(AggPI,MATCH(TRUE,(AggPIID=$A42),0),9)))","v":""},"","",{"$f":"IF(L42=\"\",\"\",ROUND(L42*G42,0))","v":""},{"$f":"IF(E43=TRUE,\"Non-Plastic\",IF(OR(M42=\"\",M43=\"\"),\"\",(ROUND(M42-M43,0))))","v":""}]
[{"$f":"Initial_Info1!B30","v":0},{"$f":"Initial_Info1!C53","v":0},{"$f":"Initial_Info1!D53","v":0},"PL",{"$f":"IF($A42=\"\",FALSE,IF(ISNA(INDEX(AggPI,MATCH(TRUE,(AggPIID=$A42),0),14)),FALSE,INDEX(AggPI,MATCH(TRUE,(AggPIID=$A42),0),14)))","v":false},null,null,{"$f":"IF($A42=\"\",\"\",IF(OR(ISNA(INDEX(AggPI,MATCH(TRUE,(AggPIID=$A42),0),7)),ISBLANK(INDEX(AggPI,MATCH(TRUE,(AggPIID=$A42),0),7))),\"\",INDEX(AggPI,MATCH(TRUE,(AggPIID=$A42),0),15)))","v":""},{"$f":"IF($A42=\"\",\"\",IF(OR(ISNA(INDEX(AggPI,MATCH(TRUE,(AggPIID=$A42),0),16)),ISBLANK(INDEX(AggPI,MATCH(TRUE,(AggPIID=$A42),0),16))),\"\",INDEX(AggPI,MATCH(TRUE,(AggPIID=$A42),0),16)))","v":""},{"$f":"IF($A42=\"\",\"\",IF(OR(ISNA(INDEX(AggPI,MATCH(TRUE,(AggPIID=$A42),0),17)),ISBLANK(INDEX(AggPI,MATCH(TRUE,(AggPIID=$A42),0),17))),\"\",INDEX(AggPI,MATCH(TRUE,(AggPIID=$A42),0),17)))","v":""},"","",{"$f":"IF(L43=\"\",\"\",ROUND(L43,0))","v":""},{"$f":"IF(O24=TRUE,\"Non-Plastic\",IF(OR(N40=\"\",O40=\"\"),\"\",(ROUND(N40-O40,0))))","v":""}]
[{"$f":"IF(Initial_Info1!B36=\"\",\"\",Initial_Info1!B36)","v":""},{"$f":"Initial_Info1!C36","v":0},{"$f":"Initial_Info1!I36","v":0},"LL",null,{"$f":"IF($A44=\"\",\"\",IF(OR(ISNA(INDEX(AggPI,MATCH(TRUE,(AggPIID=$A44),0),5)),ISBLANK(INDEX(AggPI,MATCH(TRUE,(AggPIID=$A44),0),5))),\"\",INDEX(AggPI,MATCH(TRUE,(AggPIID=$A44),0),5)))","v":""},{"$f":"IF(F44=\"\",\"\",VLOOKUP(F44,$R$29:$S$35,2,FALSE))","v":""},{"$f":"IF($A44=\"\",\"\",IF(OR(ISNA(INDEX(AggPI,MATCH(TRUE,(AggPIID=$A44),0),7)),ISBLANK(INDEX(AggPI,MATCH(TRUE,(AggPIID=$A44),0),7))),\"\",INDEX(AggPI,MATCH(TRUE,(AggPIID=$A44),0),7)))","v":""},{"$f":"IF($A44=\"\",\"\",IF(OR(ISNA(INDEX(AggPI,MATCH(TRUE,(AggPIID=$A44),0),8)),ISBLANK(INDEX(AggPI,MATCH(TRUE,(AggPIID=$A44),0),8))),\"\",INDEX(AggPI,MATCH(TRUE,(AggPIID=$A44),0),8)))","v":""},{"$f":"IF($A44=\"\",\"\",IF(OR(ISNA(INDEX(AggPI,MATCH(TRUE,(AggPIID=$A44),0),9)),ISBLANK(INDEX(AggPI,MATCH(TRUE,(AggPIID=$A44),0),9))),\"\",INDEX(AggPI,MATCH(TRUE,(AggPIID=$A44),0),9)))","v":""},"","",{"$f":"IF(L44=\"\",\"\",ROUND(L44*G44,0))","v":""},{"$f":"IF(E45=TRUE,\"Non-Plastic\",IF(OR(M44=\"\",M45=\"\"),\"\",(ROUND(M44-M45,0))))","v":""}]
[{"$f":"Initial_Info1!B32","v":0},{"$f":"Initial_Info1!C55","v":0},{"$f":"Initial_Info1!D55","v":0},"PL",{"$f":"IF($A44=\"\",FALSE,IF(ISNA(INDEX(AggPI,MATCH(TRUE,(AggPIID=$A44),0),14)),FALSE,INDEX(AggPI,MATCH(TRUE,(AggPIID=$A44),0),14)))","v":false},null,null,{"$f":"IF($A44=\"\",\"\",IF(OR(ISNA(INDEX(AggPI,MATCH(TRUE,(AggPIID=$A44),0),7)),ISBLANK(INDEX(AggPI,MATCH(TRUE,(AggPIID=$A44),0),7))),\"\",INDEX(AggPI,MATCH(TRUE,(AggPIID=$A44),0),15)))","v":""},{"$f":"IF($A44=\"\",\"\",IF(OR(ISNA(INDEX(AggPI,MATCH(TRUE,(AggPIID=$A44),0),16)),ISBLANK(INDEX(AggPI,MATCH(TRUE,(AggPIID=$A44),0),16))),\"\",INDEX(AggPI,MATCH(TRUE,(AggPIID=$A44),0),16)))","v":""},{"$f":"IF($A44=\"\",\"\",IF(OR(ISNA(INDEX(AggPI,MATCH(TRUE,(AggPIID=$A44),0),17)),ISBLANK(INDEX(AggPI,MATCH(TRUE,(AggPIID=$A44),0),17))),\"\",INDEX(AggPI,MATCH(TRUE,(AggPIID=$A44),0),17)))","v":""},"","",{"$f":"IF(L45=\"\",\"\",ROUND(L45,0))","v":""},{"$f":"IF(O26=TRUE,\"Non-Plastic\",IF(OR(N42=\"\",O42=\"\"),\"\",(ROUND(N42-O42,0))))","v":""}]
[{"$f":"IF(Initial_Info1!B37=\"\",\"\",Initial_Info1!B37)","v":""},{"$f":"Initial_Info1!C37","v":0},{"$f":"Initial_Info1!I37","v":0},"LL",null,{"$f":"IF($A46=\"\",\"\",IF(OR(ISNA(INDEX(AggPI,MATCH(TRUE,(AggPIID=$A46),0),5)),ISBLANK(INDEX(AggPI,MATCH(TRUE,(AggPIID=$A46),0),5))),\"\",INDEX(AggPI,MATCH(TRUE,(AggPIID=$A46),0),5)))","v":""},{"$f":"IF(F46=\"\",\"\",VLOOKUP(F46,$R$29:$S$35,2,FALSE))","v":""},{"$f":"IF($A46=\"\",\"\",IF(OR(ISNA(INDEX(AggPI,MATCH(TRUE,(AggPIID=$A46),0),7)),ISBLANK(INDEX(AggPI,MATCH(TRUE,(AggPIID=$A46),0),7))),\"\",INDEX(AggPI,MATCH(TRUE,(AggPIID=$A46),0),7)))","v":""},{"$f":"IF($A46=\"\",\"\",IF(OR(ISNA(INDEX(AggPI,MATCH(TRUE,(AggPIID=$A46),0),8)),ISBLANK(INDEX(AggPI,MATCH(TRUE,(AggPIID=$A46),0),8))),\"\",INDEX(AggPI,MATCH(TRUE,(AggPIID=$A46),0),8)))","v":""},{"$f":"IF($A46=\"\",\"\",IF(OR(ISNA(INDEX(AggPI,MATCH(TRUE,(AggPIID=$A46),0),9)),ISBLANK(INDEX(AggPI,MATCH(TRUE,(AggPIID=$A46),0),9))),\"\",INDEX(AggPI,MATCH(TRUE,(AggPIID=$A46),0),9)))","v":""},"","",{"$f":"IF(L46=\"\",\"\",ROUND(L46*G46,0))","v":""},{"$f":"IF(E47=TRUE,\"Non-Plastic\",IF(OR(M46=\"\",M47=\"\"),\"\",(ROUND(M46-M47,0))))","v":""}]
[{"$f":"Initial_Info1!B34","v":"Material ID ↓"},{"$f":"Initial_Info1!C57","v":0},{"$f":"Initial_Info1!D57","v":0},"PL",{"$f":"IF($A46=\"\",FALSE,IF(ISNA(INDEX(AggPI,MATCH(TRUE,(AggPIID=$A46),0),14)),FALSE,INDEX(AggPI,MATCH(TRUE,(AggPIID=$A46),0),14)))","v":false},null,null,{"$f":"IF($A46=\"\",\"\",IF(OR(ISNA(INDEX(AggPI,MATCH(TRUE,(AggPIID=$A46),0),7)),ISBLANK(INDEX(AggPI,MATCH(TRUE,(AggPIID=$A46),0),7))),\"\",INDEX(AggPI,MATCH(TRUE,(AggPIID=$A46),0),15)))","v":""},{"$f":"IF($A46=\"\",\"\",IF(OR(ISNA(INDEX(AggPI,MATCH(TRUE,(AggPIID=$A46),0),16)),ISBLANK(INDEX(AggPI,MATCH(TRUE,(AggPIID=$A46),0),16))),\"\",INDEX(AggPI,MATCH(TRUE,(AggPIID=$A46),0),16)))","v":""},{"$f":"IF($A46=\"\",\"\",IF(OR(ISNA(INDEX(AggPI,MATCH(TRUE,(AggPIID=$A46),0),17)),ISBLANK(INDEX(AggPI,MATCH(TRUE,(AggPIID=$A46),0),17))),\"\",INDEX(AggPI,MATCH(TRUE,(AggPIID=$A46),0),17)))","v":""},"","",{"$f":"IF(L47=\"\",\"\",ROUND(L47,0))","v":""},{"$f":"IF(O28=TRUE,\"Non-Plastic\",IF(OR(N44=\"\",O44=\"\"),\"\",(ROUND(N44-O44,0))))","v":""}]
[{"$f":"IF(Initial_Info1!B38=\"\",\"\",Initial_Info1!B38)","v":""},{"$f":"Initial_Info1!C38","v":0},{"$f":"Initial_Info1!I38","v":0},"LL",null,{"$f":"IF($A48=\"\",\"\",IF(OR(ISNA(INDEX(AggPI,MATCH(TRUE,(AggPIID=$A48),0),5)),ISBLANK(INDEX(AggPI,MATCH(TRUE,(AggPIID=$A48),0),5))),\"\",INDEX(AggPI,MATCH(TRUE,(AggPIID=$A48),0),5)))","v":""},{"$f":"IF(F48=\"\",\"\",VLOOKUP(F48,$R$29:$S$35,2,FALSE))","v":""},{"$f":"IF($A48=\"\",\"\",IF(OR(ISNA(INDEX(AggPI,MATCH(TRUE,(AggPIID=$A48),0),7)),ISBLANK(INDEX(AggPI,MATCH(TRUE,(AggPIID=$A48),0),7))),\"\",INDEX(AggPI,MATCH(TRUE,(AggPIID=$A48),0),7)))","v":""},{"$f":"IF($A48=\"\",\"\",IF(OR(ISNA(INDEX(AggPI,MATCH(TRUE,(AggPIID=$A48),0),8)),ISBLANK(INDEX(AggPI,MATCH(TRUE,(AggPIID=$A48),0),8))),\"\",INDEX(AggPI,MATCH(TRUE,(AggPIID=$A48),0),8)))","v":""},{"$f":"IF($A48=\"\",\"\",IF(OR(ISNA(INDEX(AggPI,MATCH(TRUE,(AggPIID=$A48),0),9)),ISBLANK(INDEX(AggPI,MATCH(TRUE,(AggPIID=$A48),0),9))),\"\",INDEX(AggPI,MATCH(TRUE,(AggPIID=$A48),0),9)))","v":""},"","",{"$f":"IF(L48=\"\",\"\",ROUND(L48*G48,0))","v":""},{"$f":"IF(E49=TRUE,\"Non-Plastic\",IF(OR(M48=\"\",M49=\"\"),\"\",(ROUND(M48-M49,0))))","v":""}]
[{"$f":"Initial_Info1!B36","v":0},{"$f":"Initial_Info1!C59","v":0},{"$f":"Initial_Info1!D59","v":0},"PL",{"$f":"IF($A48=\"\",FALSE,IF(ISNA(INDEX(AggPI,MATCH(TRUE,(AggPIID=$A48),0),14)),FALSE,INDEX(AggPI,MATCH(TRUE,(AggPIID=$A48),0),14)))","v":false},null,null,{"$f":"IF($A48=\"\",\"\",IF(OR(ISNA(INDEX(AggPI,MATCH(TRUE,(AggPIID=$A48),0),7)),ISBLANK(INDEX(AggPI,MATCH(TRUE,(AggPIID=$A48),0),7))),\"\",INDEX(AggPI,MATCH(TRUE,(AggPIID=$A48),0),15)))","v":""},{"$f":"IF($A48=\"\",\"\",IF(OR(ISNA(INDEX(AggPI,MATCH(TRUE,(AggPIID=$A48),0),16)),ISBLANK(INDEX(AggPI,MATCH(TRUE,(AggPIID=$A48),0),16))),\"\",INDEX(AggPI,MATCH(TRUE,(AggPIID=$A48),0),16)))","v":""},{"$f":"IF($A48=\"\",\"\",IF(OR(ISNA(INDEX(AggPI,MATCH(TRUE,(AggPIID=$A48),0),17)),ISBLANK(INDEX(AggPI,MATCH(TRUE,(AggPIID=$A48),0),17))),\"\",INDEX(AggPI,MATCH(TRUE,(AggPIID=$A48),0),17)))","v":""},"","",{"$f":"IF(L49=\"\",\"\",ROUND(L49,0))","v":""},{"$f":"IF(O30=TRUE,\"Non-Plastic\",IF(OR(N46=\"\",O46=\"\"),\"\",(ROUND(N46-O46,0))))","v":""}]
[{"$f":"IF(Initial_Info1!B39=\"\",\"\",Initial_Info1!B39)","v":""},{"$f":"Initial_Info1!C39","v":0},{"$f":"Initial_Info1!I39","v":0},"LL",null,{"$f":"IF($A50=\"\",\"\",IF(OR(ISNA(INDEX(AggPI,MATCH(TRUE,(AggPIID=$A50),0),5)),ISBLANK(INDEX(AggPI,MATCH(TRUE,(AggPIID=$A50),0),5))),\"\",INDEX(AggPI,MATCH(TRUE,(AggPIID=$A50),0),5)))","v":""},{"$f":"IF(F50=\"\",\"\",VLOOKUP(F50,$R$29:$S$35,2,FALSE))","v":""},{"$f":"IF($A50=\"\",\"\",IF(OR(ISNA(INDEX(AggPI,MATCH(TRUE,(AggPIID=$A50),0),7)),ISBLANK(INDEX(AggPI,MATCH(TRUE,(AggPIID=$A50),0),7))),\"\",INDEX(AggPI,MATCH(TRUE,(AggPIID=$A50),0),7)))","v":""},{"$f":"IF($A50=\"\",\"\",IF(OR(ISNA(INDEX(AggPI,MATCH(TRUE,(AggPIID=$A50),0),8)),ISBLANK(INDEX(AggPI,MATCH(TRUE,(AggPIID=$A50),0),8))),\"\",INDEX(AggPI,MATCH(TRUE,(AggPIID=$A50),0),8)))","v":""},{"$f":"IF($A50=\"\",\"\",IF(OR(ISNA(INDEX(AggPI,MATCH(TRUE,(AggPIID=$A50),0),9)),ISBLANK(INDEX(AggPI,MATCH(TRUE,(AggPIID=$A50),0),9))),\"\",INDEX(AggPI,MATCH(TRUE,(AggPIID=$A50),0),9)))","v":""},"","",{"$f":"IF(L50=\"\",\"\",ROUND(L50*G50,0))","v":""},{"$f":"IF(E51=TRUE,\"Non-Plastic\",IF(OR(M50=\"\",M51=\"\"),\"\",(ROUND(M50-M51,0))))","v":""}]
[{"$f":"Initial_Info1!B38","v":0},{"$f":"Initial_Info1!C61","v":0},{"$f":"Initial_Info1!D61","v":0},"PL",{"$f":"IF($A50=\"\",FALSE,IF(ISNA(INDEX(AggPI,MATCH(TRUE,(AggPIID=$A50),0),14)),FALSE,INDEX(AggPI,MATCH(TRUE,(AggPIID=$A50),0),14)))","v":false},null,null,{"$f":"IF($A50=\"\",\"\",IF(OR(ISNA(INDEX(AggPI,MATCH(TRUE,(AggPIID=$A50),0),7)),ISBLANK(INDEX(AggPI,MATCH(TRUE,(AggPIID=$A50),0),7))),\"\",INDEX(AggPI,MATCH(TRUE,(AggPIID=$A50),0),15)))","v":""},{"$f":"IF($A50=\"\",\"\",IF(OR(ISNA(INDEX(AggPI,MATCH(TRUE,(AggPIID=$A50),0),16)),ISBLANK(INDEX(AggPI,MATCH(TRUE,(AggPIID=$A50),0),16))),\"\",INDEX(AggPI,MATCH(TRUE,(AggPIID=$A50),0),16)))","v":""},{"$f":"IF($A50=\"\",\"\",IF(OR(ISNA(INDEX(AggPI,MATCH(TRUE,(AggPIID=$A50),0),17)),ISBLANK(INDEX(AggPI,MATCH(TRUE,(AggPIID=$A50),0),17))),\"\",INDEX(AggPI,MATCH(TRUE,(AggPIID=$A50),0),17)))","v":""},"","",{"$f":"IF(L51=\"\",\"\",ROUND(L51,0))","v":""},{"$f":"IF(O32=TRUE,\"Non-Plastic\",IF(OR(N48=\"\",O48=\"\"),\"\",(ROUND(N48-O48,0))))","v":""}]

{"sheet":"Agg_SpG","index":10,"n_rows":150,"n_cols":29,"rows_kept":150,"cut":false,"hidden":false,"merged":[[3,3,3,4],[2,12,2,14],[3,13,3,14],[2,2,2,4],[1,25,1,28]]}
[null,null,null,null,null,null,null,null,null,"AGGREGATE SPECIFIC GRAVITY"]
[null,null,null,null,null,null,null,null,null,null,null,null,null,null,null,"Mass Flask & Water","SSD Mass","Mass Flask, Sample & Water","Dry Mass","SSD Vol. of Sample","Apparent Sp.Gr.","SSD Sp.Gr.","Bulk Sp.Gr.","Absorption",null,"AGGREGATE SPECIFIC GRAVITY"]
[null,null,"AASHTO T 85 / ASTM C127",null,null,"Mass in Water","SSD Mass","Dry Mass","Apparent Sp.Gr.","SSD    Sp.Gr.","Bulk Sp.Gr.","Absorption","AASHTO T 84/ ASTM C128",null,null,"W","B","WS","A","V",null,null,null,null,null,"Apparent Sp.Gr.","SSD    Sp.Gr.","Bulk    Sp.Gr.","Absorption"]
[null,null,null,"Retained",null,"C","B","A","=A/(A-C)","=B/(B-C)","=A/(B-C)","=100*(B-A)/A",null,"Passing",null,null,null,null,null,"=W+B-WS","=A/(V-(B-A))","=B/V","=A/V","=((B-A)*100/A"]
["Material ID ↓","Source","Grading","+ #4","+ #8","(g)","(g)","(g)",null,null,null,"(%)","Recommend","- #4","- #8","(g)","(g)","(g)","(g)","(cm3)",null,null,null,"(%)",null,null,null,null,"(%)"]
[null,{"$f":"IF($A6=\"\",\"\",INDEX(Aggs,MATCH(TRUE,(AgMID=$A6),0),3))","v":""},{"$f":"IF($A6=\"\",\"\",INDEX(Aggs,MATCH(TRUE,(AgMID=$A6),0),8)&\" \"&INDEX(Aggs,MATCH(TRUE,(AgMID=$A6),0),9))","v":""},{"$f":"IF(B6=\"\",\"\",100-INDEX(Aggs,MATCH(TRUE,(AgMID=$A6),0),18))","v":""},{"$f":"IF(B6=\"\",\"\",100-INDEX(Aggs,MATCH(TRUE,(AgMID=$A6),0),19))","v":""},null,null,null,{"$f":"IFERROR(ROUND(H6/(H6-F6),3),\"\")","v":""},{"$f":"IFERROR(ROUND(G6/(G6-F6),3),\"\")","v":""},{"$f":"IFERROR(ROUND(H6/(G6-F6),3),\"\")","v":""},{"$f":"IFERROR(ROUND(100*(G6-H6)/H6,1),\"\")","v":""},{"$f":"IF(D6<30,\"FINE\",IF(AND(D6<70,E6>80),\"+ #8\",IF(E6<70,\"COMBINED\",\"+ #4\")))","v":"+ #4"},{"$f":"IF(B6=\"\",\"\",100-D6)","v":""},{"$f":"IF(C6=\"\",\"\",100-E6)","v":""},null,null,null,null,{"$f":"IF(R6=\"\",\"\",P6+Q6-R6)","v":""},{"$f":"IFERROR(ROUND(S6/(T6-(Q6-S6)),3),\"\")","v":""},{"$f":"IFERROR(ROUND(Q6/T6,3),\"\")","v":""},{"$f":"IFERROR(ROUND(S6/T6,3),\"\")","v":""},{"$f":"IFERROR(ROUND((Q6-S6)*100/S6,1),\"\")","v":""},null,{"$f":"IF(AND(I6=\"\",U6=\"\"),\"\",IF(U6=\"\",I6,IF(I6=\"\",U6,ROUND(IF($M6=\"+ #4\",100/($D6/I6+$N6/U6),100/($E6/I6+$O6/U6)),3))))","v":""},{"$f":"IF(AND(J6=\"\",V6=\"\"),\"\",IF(V6=\"\",J6,IF(J6=\"\",V6,ROUND(IF($M6=\"+ #4\",100/($D6/J6+$N6/V6),100/($E6/J6+$O6/V6)),3))))","v":""},{"$f":"IF(AND(K6=\"\",W6=\"\"),\"\",IF(W6=\"\",K6,IF(K6=\"\",W6,ROUND(IF($M6=\"+ #4\",100/($D6/K6+$N6/W6),100/($E6/K6+$O6/W6)),3))))","v":""},{"$f":"IF(AND(L6=\"\",X6=\"\"),\"\",IF(X6=\"\",L6,IF(L6=\"\",X6,ROUND(IF($M6=\"+ #4\",L6*D6/100+X6*N6/100,L6*E6/100+X6*O6/100),1))))","v":""}]
[null,{"$f":"IF($A7=\"\",\"\",INDEX(Aggs,MATCH(TRUE,(AgMID=$A7),0),3))","v":""},{"$f":"IF($A7=\"\",\"\",INDEX(Aggs,MATCH(TRUE,(AgMID=$A7),0),8)&\" \"&INDEX(Aggs,MATCH(TRUE,(AgMID=$A7),0),9))","v":""},{"$f":"IF(B7=\"\",\"\",100-INDEX(Aggs,MATCH(TRUE,(AgMID=$A7),0),18))","v":""},{"$f":"IF(B7=\"\",\"\",100-INDEX(Aggs,MATCH(TRUE,(AgMID=$A7),0),19))","v":""},null,null,null,"","","",{"$f":"IFERROR(ROUND(100*(G7-H7)/H7,1),\"\")","v":""},{"$f":"IF(D7<30,\"FINE\",IF(AND(D7<70,E7>80),\"+ #8\",IF(E7<70,\"COMBINED\",\"+ #4\")))","v":"+ #4"},{"$f":"IF(B7=\"\",\"\",100-D7)","v":""},{"$f":"IF(C7=\"\",\"\",100-E7)","v":""},null,null,null,null,"","","","","",null,{"$f":"IF(AND(I7=\"\",U7=\"\"),\"\",IF(U7=\"\",I7,IF(I7=\"\",U7,ROUND(IF($M7=\"+ #4\",100/($D7/I7+$N7/U7),100/($E7/I7+$O7/U7)),3))))","v":""},"","",{"$f":"IF(AND(L7=\"\",X7=\"\"),\"\",IF(X7=\"\",L7,IF(L7=\"\",X7,ROUND(IF($M7=\"+ #4\",L7*D7/100+X7*N7/100,L7*E7/100+X7*O7/100),1))))","v":""}]
[null,{"$f":"IF($A8=\"\",\"\",INDEX(Aggs,MATCH(TRUE,(AgMID=$A8),0),3))","v":""},{"$f":"IF($A8=\"\",\"\",INDEX(Aggs,MATCH(TRUE,(AgMID=$A8),0),8)&\" \"&INDEX(Aggs,MATCH(TRUE,(AgMID=$A8),0),9))","v":""},{"$f":"IF(B8=\"\",\"\",100-INDEX(Aggs,MATCH(TRUE,(AgMID=$A8),0),18))","v":""},{"$f":"IF(B8=\"\",\"\",100-INDEX(Aggs,MATCH(TRUE,(AgMID=$A8),0),19))","v":""},null,null,null,"","","",{"$f":"IFERROR(ROUND(100*(G8-H8)/H8,1),\"\")","v":""},"+ #4","","",null,null,null,null,"","","","","",null,"","","",""]
[null,{"$f":"IF($A9=\"\",\"\",INDEX(Aggs,MATCH(TRUE,(AgMID=$A9),0),3))","v":""},{"$f":"IF($A9=\"\",\"\",INDEX(Aggs,MATCH(TRUE,(AgMID=$A9),0),8)&\" \"&INDEX(Aggs,MATCH(TRUE,(AgMID=$A9),0),9))","v":""},{"$f":"IF(B9=\"\",\"\",100-INDEX(Aggs,MATCH(TRUE,(AgMID=$A9),0),18))","v":""},{"$f":"IF(B9=\"\",\"\",100-INDEX(Aggs,MATCH(TRUE,(AgMID=$A9),0),19))","v":""},null,null,null,"","","",{"$f":"IFERROR(ROUND(100*(G9-H9)/H9,3),\"\")","v":""},"+ #4","","",null,null,null,null,"","","","","",null,"","","",""]
[null,{"$f":"IF($A10=\"\",\"\",INDEX(Aggs,MATCH(TRUE,(AgMID=$A10),0),3))","v":""},{"$f":"IF($A10=\"\",\"\",INDEX(Aggs,MATCH(TRUE,(AgMID=$A10),0),8)&\" \"&INDEX(Aggs,MATCH(TRUE,(AgMID=$A10),0),9))","v":""},{"$f":"IF(B10=\"\",\"\",100-INDEX(Aggs,MATCH(TRUE,(AgMID=$A10),0),18))","v":""},{"$f":"IF(B10=\"\",\"\",100-INDEX(Aggs,MATCH(TRUE,(AgMID=$A10),0),19))","v":""},null,null,null,"","","","","+ #4","","",null,null,null,null,"","","","","",null,"","","",""]
[null,{"$f":"IF($A11=\"\",\"\",INDEX(Aggs,MATCH(TRUE,(AgMID=$A11),0),3))","v":""},{"$f":"IF($A11=\"\",\"\",INDEX(Aggs,MATCH(TRUE,(AgMID=$A11),0),8)&\" \"&INDEX(Aggs,MATCH(TRUE,(AgMID=$A11),0),9))","v":""},{"$f":"IF(B11=\"\",\"\",100-INDEX(Aggs,MATCH(TRUE,(AgMID=$A11),0),18))","v":""},{"$f":"IF(B11=\"\",\"\",100-INDEX(Aggs,MATCH(TRUE,(AgMID=$A11),0),19))","v":""},null,null,null,"","","","","+ #4","","",null,null,null,null,"","","","","",null,"","","",""]
[null,{"$f":"IF($A12=\"\",\"\",INDEX(Aggs,MATCH(TRUE,(AgMID=$A12),0),3))","v":""},{"$f":"IF($A12=\"\",\"\",INDEX(Aggs,MATCH(TRUE,(AgMID=$A12),0),8)&\" \"&INDEX(Aggs,MATCH(TRUE,(AgMID=$A12),0),9))","v":""},{"$f":"IF(B12=\"\",\"\",100-INDEX(Aggs,MATCH(TRUE,(AgMID=$A12),0),18))","v":""},{"$f":"IF(B12=\"\",\"\",100-INDEX(Aggs,MATCH(TRUE,(AgMID=$A12),0),19))","v":""},null,null,null,"","","","","+ #4","","",null,null,null,null,"","","","","",null,"","","",""]
[null,{"$f":"IF($A13=\"\",\"\",INDEX(Aggs,MATCH(TRUE,(AgMID=$A13),0),3))","v":""},{"$f":"IF($A13=\"\",\"\",INDEX(Aggs,MATCH(TRUE,(AgMID=$A13),0),8)&\" \"&INDEX(Aggs,MATCH(TRUE,(AgMID=$A13),0),9))","v":""},{"$f":"IF(B13=\"\",\"\",100-INDEX(Aggs,MATCH(TRUE,(AgMID=$A13),0),18))","v":""},{"$f":"IF(B13=\"\",\"\",100-INDEX(Aggs,MATCH(TRUE,(AgMID=$A13),0),19))","v":""},null,null,null,"","","","","+ #4","","",null,null,null,null,"","","","","",null,{"$f":"IF(AND(I13=\"\",U13=\"\"),\"\",IF(U13=\"\",I13,IF(I13=\"\",U13,ROUND(IF($M13=\"+ #4\",100/($D13/I13+$N13/U13),100/($E13/I13+$O13/U13)),3))))","v":""},"","",{"$f":"IF(AND(L13=\"\",X13=\"\"),\"\",IF(X13=\"\",L13,IF(L13=\"\",X13,ROUND(IF($M13=\"+ #4\",L13*D13/100+X13*N13/100,L13*E13/100+X13*O13/100),1))))","v":""}]
[null,{"$f":"IF($A14=\"\",\"\",INDEX(Aggs,MATCH(TRUE,(AgMID=$A14),0),3))","v":""},{"$f":"IF($A14=\"\",\"\",INDEX(Aggs,MATCH(TRUE,(AgMID=$A14),0),8)&\" \"&INDEX(Aggs,MATCH(TRUE,(AgMID=$A14),0),9))","v":""},{"$f":"IF(B14=\"\",\"\",100-INDEX(Aggs,MATCH(TRUE,(AgMID=$A14),0),18))","v":""},{"$f":"IF(B14=\"\",\"\",100-INDEX(Aggs,MATCH(TRUE,(AgMID=$A14),0),19))","v":""},null,null,null,"","","","","+ #4","","",null,null,null,null,"","","","","",null,"","","",{"$f":"IF(AND(L14=\"\",X14=\"\"),\"\",IF(X14=\"\",L14,IF(L14=\"\",X14,ROUND(IF($M14=\"+ #4\",L14*D14/100+X14*N14/100,L14*E14/100+X14*O14/100),1))))","v":""}]
[null,{"$f":"IF($A15=\"\",\"\",INDEX(Aggs,MATCH(TRUE,(AgMID=$A15),0),3))","v":""},{"$f":"IF($A15=\"\",\"\",INDEX(Aggs,MATCH(TRUE,(AgMID=$A15),0),8)&\" \"&INDEX(Aggs,MATCH(TRUE,(AgMID=$A15),0),9))","v":""},{"$f":"IF(B15=\"\",\"\",100-INDEX(Aggs,MATCH(TRUE,(AgMID=$A15),0),18))","v":""},{"$f":"IF(B15=\"\",\"\",100-INDEX(Aggs,MATCH(TRUE,(AgMID=$A15),0),19))","v":""},null,null,null,"","","","","+ #4","","",null,null,null,null,"","","","","",null,"","","",{"$f":"IF(AND(L15=\"\",X15=\"\"),\"\",IF(X15=\"\",L15,IF(L15=\"\",X15,ROUND(IF($M15=\"+ #4\",L15*D15/100+X15*N15/100,L15*E15/100+X15*O15/100),1))))","v":""}]
[null,{"$f":"IF($A16=\"\",\"\",INDEX(Aggs,MATCH(TRUE,(AgMID=$A16),0),3))","v":""},{"$f":"IF($A16=\"\",\"\",INDEX(Aggs,MATCH(TRUE,(AgMID=$A16),0),8)&\" \"&INDEX(Aggs,MATCH(TRUE,(AgMID=$A16),0),9))","v":""},{"$f":"IF(B16=\"\",\"\",100-INDEX(Aggs,MATCH(TRUE,(AgMID=$A16),0),18))","v":""},{"$f":"IF(B16=\"\",\"\",100-INDEX(Aggs,MATCH(TRUE,(AgMID=$A16),0),19))","v":""},null,null,null,{"$f":"IFERROR(ROUND(H16/(H16-F16),3),\"\")","v":""},{"$f":"IFERROR(ROUND(G16/(G16-F16),3),\"\")","v":""},{"$f":"IFERROR(ROUND(H16/(G16-F16),3),\"\")","v":""},{"$f":"IFERROR(ROUND(100*(G16-H16)/H16,3),\"\")","v":""},{"$f":"IF(D16<30,\"FINE\",IF(AND(D16<70,E16>80),\"+ #8\",IF(E16<70,\"COMBINED\",\"+ #4\")))","v":"+ #4"},{"$f":"IF(B16=\"\",\"\",100-D16)","v":""},{"$f":"IF(C16=\"\",\"\",100-E16)","v":""},null,null,null,null,{"$f":"IF(R16=\"\",\"\",P16+Q16-R16)","v":""},{"$f":"IFERROR(ROUND(S16/(T16-(Q16-S16)),3),\"\")","v":""},{"$f":"IFERROR(ROUND(Q16/T16,3),\"\")","v":""},{"$f":"IFERROR(ROUND(S16/T16,3),\"\")","v":""},{"$f":"IFERROR(ROUND((Q16-S16)*100/S16,1),\"\")","v":""},null,{"$f":"IF(AND(I16=\"\",U16=\"\"),\"\",IF(U16=\"\",I16,IF(I16=\"\",U16,ROUND(IF($M16=\"+ #4\",100/($D16/I16+$N16/U16),100/($E16/I16+$O16/U16)),3))))","v":""},{"$f":"IF(AND(J16=\"\",V16=\"\"),\"\",IF(V16=\"\",J16,IF(J16=\"\",V16,ROUND(IF($M16=\"+ #4\",100/($D16/J16+$N16/V16),100/($E16/J16+$O16/V16)),3))))","v":""},{"$f":"IF(AND(K16=\"\",W16=\"\"),\"\",IF(W16=\"\",K16,IF(K16=\"\",W16,ROUND(IF($M16=\"+ #4\",100/($D16/K16+$N16/W16),100/($E16/K16+$O16/W16)),3))))","v":""},{"$f":"IF(AND(L16=\"\",X16=\"\"),\"\",IF(X16=\"\",L16,IF(L16=\"\",X16,ROUND(IF($M16=\"+ #4\",L16*D16/100+X16*N16/100,L16*E16/100+X16*O16/100),1))))","v":""}]
[null,{"$f":"IF($A17=\"\",\"\",INDEX(Aggs,MATCH(TRUE,(AgMID=$A17),0),3))","v":""},{"$f":"IF($A17=\"\",\"\",INDEX(Aggs,MATCH(TRUE,(AgMID=$A17),0),8)&\" \"&INDEX(Aggs,MATCH(TRUE,(AgMID=$A17),0),9))","v":""},{"$f":"IF(B17=\"\",\"\",100-INDEX(Aggs,MATCH(TRUE,(AgMID=$A17),0),18))","v":""},{"$f":"IF(B17=\"\",\"\",100-INDEX(Aggs,MATCH(TRUE,(AgMID=$A17),0),19))","v":""},null,null,null,"","","","","+ #4","","",null,null,null,null,"","","","","",null,"","","",""]
[null,{"$f":"IF($A18=\"\",\"\",INDEX(Aggs,MATCH(TRUE,(AgMID=$A18),0),3))","v":""},{"$f":"IF($A18=\"\",\"\",INDEX(Aggs,MATCH(TRUE,(AgMID=$A18),0),8)&\" \"&INDEX(Aggs,MATCH(TRUE,(AgMID=$A18),0),9))","v":""},{"$f":"IF(B18=\"\",\"\",100-INDEX(Aggs,MATCH(TRUE,(AgMID=$A18),0),18))","v":""},{"$f":"IF(B18=\"\",\"\",100-INDEX(Aggs,MATCH(TRUE,(AgMID=$A18),0),19))","v":""},null,null,null,"","","","","+ #4","","",null,null,null,null,"","","","","",null,"","","",""]
[null,{"$f":"IF($A19=\"\",\"\",INDEX(Aggs,MATCH(TRUE,(AgMID=$A19),0),3))","v":""},{"$f":"IF($A19=\"\",\"\",INDEX(Aggs,MATCH(TRUE,(AgMID=$A19),0),8)&\" \"&INDEX(Aggs,MATCH(TRUE,(AgMID=$A19),0),9))","v":""},{"$f":"IF(B19=\"\",\"\",100-INDEX(Aggs,MATCH(TRUE,(AgMID=$A19),0),18))","v":""},{"$f":"IF(B19=\"\",\"\",100-INDEX(Aggs,MATCH(TRUE,(AgMID=$A19),0),19))","v":""},null,null,null,"","","","","+ #4","","",null,null,null,null,"","","","","",null,"","","",""]
[null,{"$f":"IF($A20=\"\",\"\",INDEX(Aggs,MATCH(TRUE,(AgMID=$A20),0),3))","v":""},{"$f":"IF($A20=\"\",\"\",INDEX(Aggs,MATCH(TRUE,(AgMID=$A20),0),8)&\" \"&INDEX(Aggs,MATCH(TRUE,(AgMID=$A20),0),9))","v":""},{"$f":"IF(B20=\"\",\"\",100-INDEX(Aggs,MATCH(TRUE,(AgMID=$A20),0),18))","v":""},{"$f":"IF(B20=\"\",\"\",100-INDEX(Aggs,MATCH(TRUE,(AgMID=$A20),0),19))","v":""},null,null,null,"","","","","+ #4","","",null,null,null,null,"","","","","",null,"","","",""]
[null,{"$f":"IF($A21=\"\",\"\",INDEX(Aggs,MATCH(TRUE,(AgMID=$A21),0),3))","v":""},{"$f":"IF($A21=\"\",\"\",INDEX(Aggs,MATCH(TRUE,(AgMID=$A21),0),8)&\" \"&INDEX(Aggs,MATCH(TRUE,(AgMID=$A21),0),9))","v":""},{"$f":"IF(B21=\"\",\"\",100-INDEX(Aggs,MATCH(TRUE,(AgMID=$A21),0),18))","v":""},{"$f":"IF(B21=\"\",\"\",100-INDEX(Aggs,MATCH(TRUE,(AgMID=$A21),0),19))","v":""},null,null,null,"","","","","+ #4","","",null,null,null,null,"","","","","",null,"","","",""]
[null,{"$f":"IF($A22=\"\",\"\",INDEX(Aggs,MATCH(TRUE,(AgMID=$A22),0),3))","v":""},{"$f":"IF($A22=\"\",\"\",INDEX(Aggs,MATCH(TRUE,(AgMID=$A22),0),8)&\" \"&INDEX(Aggs,MATCH(TRUE,(AgMID=$A22),0),9))","v":""},{"$f":"IF(B22=\"\",\"\",100-INDEX(Aggs,MATCH(TRUE,(AgMID=$A22),0),18))","v":""},{"$f":"IF(B22=\"\",\"\",100-INDEX(Aggs,MATCH(TRUE,(AgMID=$A22),0),19))","v":""},null,null,null,"","","","","+ #4","","",null,null,null,null,"","","","","",null,"","","",""]
[null,{"$f":"IF($A23=\"\",\"\",INDEX(Aggs,MATCH(TRUE,(AgMID=$A23),0),3))","v":""},{"$f":"IF($A23=\"\",\"\",INDEX(Aggs,MATCH(TRUE,(AgMID=$A23),0),8)&\" \"&INDEX(Aggs,MATCH(TRUE,(AgMID=$A23),0),9))","v":""},{"$f":"IF(B23=\"\",\"\",100-INDEX(Aggs,MATCH(TRUE,(AgMID=$A23),0),18))","v":""},{"$f":"IF(B23=\"\",\"\",100-INDEX(Aggs,MATCH(TRUE,(AgMID=$A23),0),19))","v":""},null,null,null,"","","","","+ #4","","",null,null,null,null,"","","","","",null,"","","",""]
[null,{"$f":"IF($A24=\"\",\"\",INDEX(Aggs,MATCH(TRUE,(AgMID=$A24),0),3))","v":""},{"$f":"IF($A24=\"\",\"\",INDEX(Aggs,MATCH(TRUE,(AgMID=$A24),0),8)&\" \"&INDEX(Aggs,MATCH(TRUE,(AgMID=$A24),0),9))","v":""},{"$f":"IF(B24=\"\",\"\",100-INDEX(Aggs,MATCH(TRUE,(AgMID=$A24),0),18))","v":""},{"$f":"IF(B24=\"\",\"\",100-INDEX(Aggs,MATCH(TRUE,(AgMID=$A24),0),19))","v":""},null,null,null,"","","","","+ #4","","",null,null,null,null,"","","","","",null,"","","",""]
[null,{"$f":"IF($A25=\"\",\"\",INDEX(Aggs,MATCH(TRUE,(AgMID=$A25),0),3))","v":""},{"$f":"IF($A25=\"\",\"\",INDEX(Aggs,MATCH(TRUE,(AgMID=$A25),0),8)&\" \"&INDEX(Aggs,MATCH(TRUE,(AgMID=$A25),0),9))","v":""},{"$f":"IF(B25=\"\",\"\",100-INDEX(Aggs,MATCH(TRUE,(AgMID=$A25),0),18))","v":""},{"$f":"IF(B25=\"\",\"\",100-INDEX(Aggs,MATCH(TRUE,(AgMID=$A25),0),19))","v":""},null,null,null,"","","","","+ #4","","",null,null,null,null,"","","","","",null,"","","",""]
[null,{"$f":"IF($A26=\"\",\"\",INDEX(Aggs,MATCH(TRUE,(AgMID=$A26),0),3))","v":""},{"$f":"IF($A26=\"\",\"\",INDEX(Aggs,MATCH(TRUE,(AgMID=$A26),0),8)&\" \"&INDEX(Aggs,MATCH(TRUE,(AgMID=$A26),0),9))","v":""},{"$f":"IF(B26=\"\",\"\",100-INDEX(Aggs,MATCH(TRUE,(AgMID=$A26),0),18))","v":""},{"$f":"IF(B26=\"\",\"\",100-INDEX(Aggs,MATCH(TRUE,(AgMID=$A26),0),19))","v":""},null,null,null,"","","","","+ #4","","",null,null,null,null,"","","","","",null,"","","",""]
[null,{"$f":"IF($A27=\"\",\"\",INDEX(Aggs,MATCH(TRUE,(AgMID=$A27),0),3))","v":""},{"$f":"IF($A27=\"\",\"\",INDEX(Aggs,MATCH(TRUE,(AgMID=$A27),0),8)&\" \"&INDEX(Aggs,MATCH(TRUE,(AgMID=$A27),0),9))","v":""},{"$f":"IF(B27=\"\",\"\",100-INDEX(Aggs,MATCH(TRUE,(AgMID=$A27),0),18))","v":""},{"$f":"IF(B27=\"\",\"\",100-INDEX(Aggs,MATCH(TRUE,(AgMID=$A27),0),19))","v":""},null,null,null,"","","","","+ #4","","",null,null,null,null,"","","","","",null,"","","",""]
[null,{"$f":"IF($A28=\"\",\"\",INDEX(Aggs,MATCH(TRUE,(AgMID=$A28),0),3))","v":""},{"$f":"IF($A28=\"\",\"\",INDEX(Aggs,MATCH(TRUE,(AgMID=$A28),0),8)&\" \"&INDEX(Aggs,MATCH(TRUE,(AgMID=$A28),0),9))","v":""},{"$f":"IF(B28=\"\",\"\",100-INDEX(Aggs,MATCH(TRUE,(AgMID=$A28),0),18))","v":""},{"$f":"IF(B28=\"\",\"\",100-INDEX(Aggs,MATCH(TRUE,(AgMID=$A28),0),19))","v":""},null,null,null,"","","","","+ #4","","",null,null,null,null,"","","","","",null,"","","",""]
[null,{"$f":"IF($A29=\"\",\"\",INDEX(Aggs,MATCH(TRUE,(AgMID=$A29),0),3))","v":""},{"$f":"IF($A29=\"\",\"\",INDEX(Aggs,MATCH(TRUE,(AgMID=$A29),0),8)&\" \"&INDEX(Aggs,MATCH(TRUE,(AgMID=$A29),0),9))","v":""},{"$f":"IF(B29=\"\",\"\",100-INDEX(Aggs,MATCH(TRUE,(AgMID=$A29),0),18))","v":""},{"$f":"IF(B29=\"\",\"\",100-INDEX(Aggs,MATCH(TRUE,(AgMID=$A29),0),19))","v":""},null,null,null,"","","","","+ #4","","",null,null,null,null,"","","","","",null,"","","",""]
[null,{"$f":"IF($A30=\"\",\"\",INDEX(Aggs,MATCH(TRUE,(AgMID=$A30),0),3))","v":""},{"$f":"IF($A30=\"\",\"\",INDEX(Aggs,MATCH(TRUE,(AgMID=$A30),0),8)&\" \"&INDEX(Aggs,MATCH(TRUE,(AgMID=$A30),0),9))","v":""},{"$f":"IF(B30=\"\",\"\",100-INDEX(Aggs,MATCH(TRUE,(AgMID=$A30),0),18))","v":""},{"$f":"IF(B30=\"\",\"\",100-INDEX(Aggs,MATCH(TRUE,(AgMID=$A30),0),19))","v":""},null,null,null,"","","","","+ #4","","",null,null,null,null,"","","","","",null,"","","",""]
[null,{"$f":"IF($A31=\"\",\"\",INDEX(Aggs,MATCH(TRUE,(AgMID=$A31),0),3))","v":""},{"$f":"IF($A31=\"\",\"\",INDEX(Aggs,MATCH(TRUE,(AgMID=$A31),0),8)&\" \"&INDEX(Aggs,MATCH(TRUE,(AgMID=$A31),0),9))","v":""},{"$f":"IF(B31=\"\",\"\",100-INDEX(Aggs,MATCH(TRUE,(AgMID=$A31),0),18))","v":""},{"$f":"IF(B31=\"\",\"\",100-INDEX(Aggs,MATCH(TRUE,(AgMID=$A31),0),19))","v":""},null,null,null,"","","","","+ #4","","",null,null,null,null,"","","","","",null,"","","",""]
[null,{"$f":"IF($A32=\"\",\"\",INDEX(Aggs,MATCH(TRUE,(AgMID=$A32),0),3))","v":""},{"$f":"IF($A32=\"\",\"\",INDEX(Aggs,MATCH(TRUE,(AgMID=$A32),0),8)&\" \"&INDEX(Aggs,MATCH(TRUE,(AgMID=$A32),0),9))","v":""},{"$f":"IF(B32=\"\",\"\",100-INDEX(Aggs,MATCH(TRUE,(AgMID=$A32),0),18))","v":""},{"$f":"IF(B32=\"\",\"\",100-INDEX(Aggs,MATCH(TRUE,(AgMID=$A32),0),19))","v":""},null,null,null,"","","","","+ #4","","",null,null,null,null,"","","","","",null,"","","",""]
[null,{"$f":"IF($A33=\"\",\"\",INDEX(Aggs,MATCH(TRUE,(AgMID=$A33),0),3))","v":""},{"$f":"IF($A33=\"\",\"\",INDEX(Aggs,MATCH(TRUE,(AgMID=$A33),0),8)&\" \"&INDEX(Aggs,MATCH(TRUE,(AgMID=$A33),0),9))","v":""},{"$f":"IF(B33=\"\",\"\",100-INDEX(Aggs,MATCH(TRUE,(AgMID=$A33),0),18))","v":""},{"$f":"IF(B33=\"\",\"\",100-INDEX(Aggs,MATCH(TRUE,(AgMID=$A33),0),19))","v":""},null,null,null,"","","","","+ #4","","",null,null,null,null,"","","","","",null,"","","",""]
[null,{"$f":"IF($A34=\"\",\"\",INDEX(Aggs,MATCH(TRUE,(AgMID=$A34),0),3))","v":""},{"$f":"IF($A34=\"\",\"\",INDEX(Aggs,MATCH(TRUE,(AgMID=$A34),0),8)&\" \"&INDEX(Aggs,MATCH(TRUE,(AgMID=$A34),0),9))","v":""},{"$f":"IF(B34=\"\",\"\",100-INDEX(Aggs,MATCH(TRUE,(AgMID=$A34),0),18))","v":""},{"$f":"IF(B34=\"\",\"\",100-INDEX(Aggs,MATCH(TRUE,(AgMID=$A34),0),19))","v":""},null,null,null,"","","","","+ #4","","",null,null,null,null,"","","","","",null,"","","",""]
[null,{"$f":"IF($A35=\"\",\"\",INDEX(Aggs,MATCH(TRUE,(AgMID=$A35),0),3))","v":""},{"$f":"IF($A35=\"\",\"\",INDEX(Aggs,MATCH(TRUE,(AgMID=$A35),0),8)&\" \"&INDEX(Aggs,MATCH(TRUE,(AgMID=$A35),0),9))","v":""},{"$f":"IF(B35=\"\",\"\",100-INDEX(Aggs,MATCH(TRUE,(AgMID=$A35),0),18))","v":""},{"$f":"IF(B35=\"\",\"\",100-INDEX(Aggs,MATCH(TRUE,(AgMID=$A35),0),19))","v":""},null,null,null,"","","","","+ #4","","",null,null,null,null,"","","","","",null,"","","",""]
[null,{"$f":"IF($A36=\"\",\"\",INDEX(Aggs,MATCH(TRUE,(AgMID=$A36),0),3))","v":""},{"$f":"IF($A36=\"\",\"\",INDEX(Aggs,MATCH(TRUE,(AgMID=$A36),0),8)&\" \"&INDEX(Aggs,MATCH(TRUE,(AgMID=$A36),0),9))","v":""},{"$f":"IF(B36=\"\",\"\",100-INDEX(Aggs,MATCH(TRUE,(AgMID=$A36),0),18))","v":""},{"$f":"IF(B36=\"\",\"\",100-INDEX(Aggs,MATCH(TRUE,(AgMID=$A36),0),19))","v":""},null,null,null,"","","","","+ #4","","",null,null,null,null,"","","","","",null,"","","",""]
[null,{"$f":"IF($A37=\"\",\"\",INDEX(Aggs,MATCH(TRUE,(AgMID=$A37),0),3))","v":""},{"$f":"IF($A37=\"\",\"\",INDEX(Aggs,MATCH(TRUE,(AgMID=$A37),0),8)&\" \"&INDEX(Aggs,MATCH(TRUE,(AgMID=$A37),0),9))","v":""},{"$f":"IF(B37=\"\",\"\",100-INDEX(Aggs,MATCH(TRUE,(AgMID=$A37),0),18))","v":""},{"$f":"IF(B37=\"\",\"\",100-INDEX(Aggs,MATCH(TRUE,(AgMID=$A37),0),19))","v":""},null,null,null,"","","","","+ #4","","",null,null,null,null,"","","","","",null,"","","",""]
[null,{"$f":"IF($A38=\"\",\"\",INDEX(Aggs,MATCH(TRUE,(AgMID=$A38),0),3))","v":""},{"$f":"IF($A38=\"\",\"\",INDEX(Aggs,MATCH(TRUE,(AgMID=$A38),0),8)&\" \"&INDEX(Aggs,MATCH(TRUE,(AgMID=$A38),0),9))","v":""},{"$f":"IF(B38=\"\",\"\",100-INDEX(Aggs,MATCH(TRUE,(AgMID=$A38),0),18))","v":""},{"$f":"IF(B38=\"\",\"\",100-INDEX(Aggs,MATCH(TRUE,(AgMID=$A38),0),19))","v":""},null,null,null,"","","","","+ #4","","",null,null,null,null,"","","","","",null,"","","",""]
[null,{"$f":"IF($A39=\"\",\"\",INDEX(Aggs,MATCH(TRUE,(AgMID=$A39),0),3))","v":""},{"$f":"IF($A39=\"\",\"\",INDEX(Aggs,MATCH(TRUE,(AgMID=$A39),0),8)&\" \"&INDEX(Aggs,MATCH(TRUE,(AgMID=$A39),0),9))","v":""},{"$f":"IF(B39=\"\",\"\",100-INDEX(Aggs,MATCH(TRUE,(AgMID=$A39),0),18))","v":""},{"$f":"IF(B39=\"\",\"\",100-INDEX(Aggs,MATCH(TRUE,(AgMID=$A39),0),19))","v":""},null,null,null,"","","","","+ #4","","",null,null,null,null,"","","","","",null,"","","",""]
[null,{"$f":"IF($A40=\"\",\"\",INDEX(Aggs,MATCH(TRUE,(AgMID=$A40),0),3))","v":""},{"$f":"IF($A40=\"\",\"\",INDEX(Aggs,MATCH(TRUE,(AgMID=$A40),0),8)&\" \"&INDEX(Aggs,MATCH(TRUE,(AgMID=$A40),0),9))","v":""},{"$f":"IF(B40=\"\",\"\",100-INDEX(Aggs,MATCH(TRUE,(AgMID=$A40),0),18))","v":""},{"$f":"IF(B40=\"\",\"\",100-INDEX(Aggs,MATCH(TRUE,(AgMID=$A40),0),19))","v":""},null,null,null,"","","","","+ #4","","",null,null,null,null,"","","","","",null,"","","",""]
[null,{"$f":"IF($A41=\"\",\"\",INDEX(Aggs,MATCH(TRUE,(AgMID=$A41),0),3))","v":""},{"$f":"IF($A41=\"\",\"\",INDEX(Aggs,MATCH(TRUE,(AgMID=$A41),0),8)&\" \"&INDEX(Aggs,MATCH(TRUE,(AgMID=$A41),0),9))","v":""},{"$f":"IF(B41=\"\",\"\",100-INDEX(Aggs,MATCH(TRUE,(AgMID=$A41),0),18))","v":""},{"$f":"IF(B41=\"\",\"\",100-INDEX(Aggs,MATCH(TRUE,(AgMID=$A41),0),19))","v":""},null,null,null,"","","","","+ #4","","",null,null,null,null,"","","","","",null,"","","",""]
[null,{"$f":"IF($A42=\"\",\"\",INDEX(Aggs,MATCH(TRUE,(AgMID=$A42),0),3))","v":""},{"$f":"IF($A42=\"\",\"\",INDEX(Aggs,MATCH(TRUE,(AgMID=$A42),0),8)&\" \"&INDEX(Aggs,MATCH(TRUE,(AgMID=$A42),0),9))","v":""},{"$f":"IF(B42=\"\",\"\",100-INDEX(Aggs,MATCH(TRUE,(AgMID=$A42),0),18))","v":""},{"$f":"IF(B42=\"\",\"\",100-INDEX(Aggs,MATCH(TRUE,(AgMID=$A42),0),19))","v":""},null,null,null,"","","","","+ #4","","",null,null,null,null,"","","","","",null,"","","",""]
[null,{"$f":"IF($A43=\"\",\"\",INDEX(Aggs,MATCH(TRUE,(AgMID=$A43),0),3))","v":""},{"$f":"IF($A43=\"\",\"\",INDEX(Aggs,MATCH(TRUE,(AgMID=$A43),0),8)&\" \"&INDEX(Aggs,MATCH(TRUE,(AgMID=$A43),0),9))","v":""},{"$f":"IF(B43=\"\",\"\",100-INDEX(Aggs,MATCH(TRUE,(AgMID=$A43),0),18))","v":""},{"$f":"IF(B43=\"\",\"\",100-INDEX(Aggs,MATCH(TRUE,(AgMID=$A43),0),19))","v":""},null,null,null,"","","","","+ #4","","",null,null,null,null,"","","","","",null,"","","",""]
[null,{"$f":"IF($A44=\"\",\"\",INDEX(Aggs,MATCH(TRUE,(AgMID=$A44),0),3))","v":""},{"$f":"IF($A44=\"\",\"\",INDEX(Aggs,MATCH(TRUE,(AgMID=$A44),0),8)&\" \"&INDEX(Aggs,MATCH(TRUE,(AgMID=$A44),0),9))","v":""},{"$f":"IF(B44=\"\",\"\",100-INDEX(Aggs,MATCH(TRUE,(AgMID=$A44),0),18))","v":""},{"$f":"IF(B44=\"\",\"\",100-INDEX(Aggs,MATCH(TRUE,(AgMID=$A44),0),19))","v":""},null,null,null,"","","","","+ #4","","",null,null,null,null,"","","","","",null,"","","",""]
[null,{"$f":"IF($A45=\"\",\"\",INDEX(Aggs,MATCH(TRUE,(AgMID=$A45),0),3))","v":""},{"$f":"IF($A45=\"\",\"\",INDEX(Aggs,MATCH(TRUE,(AgMID=$A45),0),8)&\" \"&INDEX(Aggs,MATCH(TRUE,(AgMID=$A45),0),9))","v":""},{"$f":"IF(B45=\"\",\"\",100-INDEX(Aggs,MATCH(TRUE,(AgMID=$A45),0),18))","v":""},{"$f":"IF(B45=\"\",\"\",100-INDEX(Aggs,MATCH(TRUE,(AgMID=$A45),0),19))","v":""},null,null,null,"","","","","+ #4","","",null,null,null,null,"","","","","",null,"","","",""]
[null,{"$f":"IF($A46=\"\",\"\",INDEX(Aggs,MATCH(TRUE,(AgMID=$A46),0),3))","v":""},{"$f":"IF($A46=\"\",\"\",INDEX(Aggs,MATCH(TRUE,(AgMID=$A46),0),8)&\" \"&INDEX(Aggs,MATCH(TRUE,(AgMID=$A46),0),9))","v":""},{"$f":"IF(B46=\"\",\"\",100-INDEX(Aggs,MATCH(TRUE,(AgMID=$A46),0),18))","v":""},{"$f":"IF(B46=\"\",\"\",100-INDEX(Aggs,MATCH(TRUE,(AgMID=$A46),0),19))","v":""},null,null,null,"","","","","+ #4","","",null,null,null,null,"","","","","",null,"","","",""]
[null,{"$f":"IF($A47=\"\",\"\",INDEX(Aggs,MATCH(TRUE,(AgMID=$A47),0),3))","v":""},{"$f":"IF($A47=\"\",\"\",INDEX(Aggs,MATCH(TRUE,(AgMID=$A47),0),8)&\" \"&INDEX(Aggs,MATCH(TRUE,(AgMID=$A47),0),9))","v":""},{"$f":"IF(B47=\"\",\"\",100-INDEX(Aggs,MATCH(TRUE,(AgMID=$A47),0),18))","v":""},{"$f":"IF(B47=\"\",\"\",100-INDEX(Aggs,MATCH(TRUE,(AgMID=$A47),0),19))","v":""},null,null,null,"","","","","+ #4","","",null,null,null,null,"","","","","",null,"","","",""]
[null,{"$f":"IF($A48=\"\",\"\",INDEX(Aggs,MATCH(TRUE,(AgMID=$A48),0),3))","v":""},{"$f":"IF($A48=\"\",\"\",INDEX(Aggs,MATCH(TRUE,(AgMID=$A48),0),8)&\" \"&INDEX(Aggs,MATCH(TRUE,(AgMID=$A48),0),9))","v":""},{"$f":"IF(B48=\"\",\"\",100-INDEX(Aggs,MATCH(TRUE,(AgMID=$A48),0),18))","v":""},{"$f":"IF(B48=\"\",\"\",100-INDEX(Aggs,MATCH(TRUE,(AgMID=$A48),0),19))","v":""},null,null,null,"","","","","+ #4","","",null,null,null,null,"","","","","",null,"","","",""]
[null,{"$f":"IF($A49=\"\",\"\",INDEX(Aggs,MATCH(TRUE,(AgMID=$A49),0),3))","v":""},{"$f":"IF($A49=\"\",\"\",INDEX(Aggs,MATCH(TRUE,(AgMID=$A49),0),8)&\" \"&INDEX(Aggs,MATCH(TRUE,(AgMID=$A49),0),9))","v":""},{"$f":"IF(B49=\"\",\"\",100-INDEX(Aggs,MATCH(TRUE,(AgMID=$A49),0),18))","v":""},{"$f":"IF(B49=\"\",\"\",100-INDEX(Aggs,MATCH(TRUE,(AgMID=$A49),0),19))","v":""},null,null,null,"","","","","+ #4","","",null,null,null,null,"","","","","",null,"","","",""]
[null,{"$f":"IF($A50=\"\",\"\",INDEX(Aggs,MATCH(TRUE,(AgMID=$A50),0),3))","v":""},{"$f":"IF($A50=\"\",\"\",INDEX(Aggs,MATCH(TRUE,(AgMID=$A50),0),8)&\" \"&INDEX(Aggs,MATCH(TRUE,(AgMID=$A50),0),9))","v":""},{"$f":"IF(B50=\"\",\"\",100-INDEX(Aggs,MATCH(TRUE,(AgMID=$A50),0),18))","v":""},{"$f":"IF(B50=\"\",\"\",100-INDEX(Aggs,MATCH(TRUE,(AgMID=$A50),0),19))","v":""},null,null,null,"","","","","+ #4","","",null,null,null,null,"","","","","",null,"","","",""]
[null,{"$f":"IF($A51=\"\",\"\",INDEX(Aggs,MATCH(TRUE,(AgMID=$A51),0),3))","v":""},{"$f":"IF($A51=\"\",\"\",INDEX(Aggs,MATCH(TRUE,(AgMID=$A51),0),8)&\" \"&INDEX(Aggs,MATCH(TRUE,(AgMID=$A51),0),9))","v":""},{"$f":"IF(B51=\"\",\"\",100-INDEX(Aggs,MATCH(TRUE,(AgMID=$A51),0),18))","v":""},{"$f":"IF(B51=\"\",\"\",100-INDEX(Aggs,MATCH(TRUE,(AgMID=$A51),0),19))","v":""},null,null,null,"","","","","+ #4","","",null,null,null,null,"","","","","",null,"","","",""]
[null,{"$f":"IF($A52=\"\",\"\",INDEX(Aggs,MATCH(TRUE,(AgMID=$A52),0),3))","v":""},{"$f":"IF($A52=\"\",\"\",INDEX(Aggs,MATCH(TRUE,(AgMID=$A52),0),8)&\" \"&INDEX(Aggs,MATCH(TRUE,(AgMID=$A52),0),9))","v":""},{"$f":"IF(B52=\"\",\"\",100-INDEX(Aggs,MATCH(TRUE,(AgMID=$A52),0),18))","v":""},{"$f":"IF(B52=\"\",\"\",100-INDEX(Aggs,MATCH(TRUE,(AgMID=$A52),0),19))","v":""},null,null,null,"","","","","+ #4","","",null,null,null,null,"","","","","",null,"","","",""]
[null,{"$f":"IF($A53=\"\",\"\",INDEX(Aggs,MATCH(TRUE,(AgMID=$A53),0),3))","v":""},{"$f":"IF($A53=\"\",\"\",INDEX(Aggs,MATCH(TRUE,(AgMID=$A53),0),8)&\" \"&INDEX(Aggs,MATCH(TRUE,(AgMID=$A53),0),9))","v":""},{"$f":"IF(B53=\"\",\"\",100-INDEX(Aggs,MATCH(TRUE,(AgMID=$A53),0),18))","v":""},{"$f":"IF(B53=\"\",\"\",100-INDEX(Aggs,MATCH(TRUE,(AgMID=$A53),0),19))","v":""},null,null,null,"","","","","+ #4","","",null,null,null,null,"","","","","",null,"","","",""]
[null,{"$f":"IF($A54=\"\",\"\",INDEX(Aggs,MATCH(TRUE,(AgMID=$A54),0),3))","v":""},{"$f":"IF($A54=\"\",\"\",INDEX(Aggs,MATCH(TRUE,(AgMID=$A54),0),8)&\" \"&INDEX(Aggs,MATCH(TRUE,(AgMID=$A54),0),9))","v":""},{"$f":"IF(B54=\"\",\"\",100-INDEX(Aggs,MATCH(TRUE,(AgMID=$A54),0),18))","v":""},{"$f":"IF(B54=\"\",\"\",100-INDEX(Aggs,MATCH(TRUE,(AgMID=$A54),0),19))","v":""},null,null,null,"","","","","+ #4","","",null,null,null,null,"","","","","",null,"","","",""]
[null,{"$f":"IF($A55=\"\",\"\",INDEX(Aggs,MATCH(TRUE,(AgMID=$A55),0),3))","v":""},{"$f":"IF($A55=\"\",\"\",INDEX(Aggs,MATCH(TRUE,(AgMID=$A55),0),8)&\" \"&INDEX(Aggs,MATCH(TRUE,(AgMID=$A55),0),9))","v":""},{"$f":"IF(B55=\"\",\"\",100-INDEX(Aggs,MATCH(TRUE,(AgMID=$A55),0),18))","v":""},{"$f":"IF(B55=\"\",\"\",100-INDEX(Aggs,MATCH(TRUE,(AgMID=$A55),0),19))","v":""},null,null,null,"","","","","+ #4","","",null,null,null,null,"","","","","",null,"","","",""]
[null,{"$f":"IF($A56=\"\",\"\",INDEX(Aggs,MATCH(TRUE,(AgMID=$A56),0),3))","v":""},{"$f":"IF($A56=\"\",\"\",INDEX(Aggs,MATCH(TRUE,(AgMID=$A56),0),8)&\" \"&INDEX(Aggs,MATCH(TRUE,(AgMID=$A56),0),9))","v":""},{"$f":"IF(B56=\"\",\"\",100-INDEX(Aggs,MATCH(TRUE,(AgMID=$A56),0),18))","v":""},{"$f":"IF(B56=\"\",\"\",100-INDEX(Aggs,MATCH(TRUE,(AgMID=$A56),0),19))","v":""},null,null,null,"","","","","+ #4","","",null,null,null,null,"","","","","",null,"","","",""]
[null,{"$f":"IF($A57=\"\",\"\",INDEX(Aggs,MATCH(TRUE,(AgMID=$A57),0),3))","v":""},{"$f":"IF($A57=\"\",\"\",INDEX(Aggs,MATCH(TRUE,(AgMID=$A57),0),8)&\" \"&INDEX(Aggs,MATCH(TRUE,(AgMID=$A57),0),9))","v":""},{"$f":"IF(B57=\"\",\"\",100-INDEX(Aggs,MATCH(TRUE,(AgMID=$A57),0),18))","v":""},{"$f":"IF(B57=\"\",\"\",100-INDEX(Aggs,MATCH(TRUE,(AgMID=$A57),0),19))","v":""},null,null,null,"","","","","+ #4","","",null,null,null,null,"","","","","",null,"","","",""]
[null,{"$f":"IF($A58=\"\",\"\",INDEX(Aggs,MATCH(TRUE,(AgMID=$A58),0),3))","v":""},{"$f":"IF($A58=\"\",\"\",INDEX(Aggs,MATCH(TRUE,(AgMID=$A58),0),8)&\" \"&INDEX(Aggs,MATCH(TRUE,(AgMID=$A58),0),9))","v":""},{"$f":"IF(B58=\"\",\"\",100-INDEX(Aggs,MATCH(TRUE,(AgMID=$A58),0),18))","v":""},{"$f":"IF(B58=\"\",\"\",100-INDEX(Aggs,MATCH(TRUE,(AgMID=$A58),0),19))","v":""},null,null,null,"","","","","+ #4","","",null,null,null,null,"","","","","",null,"","","",""]
[null,{"$f":"IF($A59=\"\",\"\",INDEX(Aggs,MATCH(TRUE,(AgMID=$A59),0),3))","v":""},{"$f":"IF($A59=\"\",\"\",INDEX(Aggs,MATCH(TRUE,(AgMID=$A59),0),8)&\" \"&INDEX(Aggs,MATCH(TRUE,(AgMID=$A59),0),9))","v":""},{"$f":"IF(B59=\"\",\"\",100-INDEX(Aggs,MATCH(TRUE,(AgMID=$A59),0),18))","v":""},{"$f":"IF(B59=\"\",\"\",100-INDEX(Aggs,MATCH(TRUE,(AgMID=$A59),0),19))","v":""},null,null,null,"","","","","+ #4","","",null,null,null,null,"","","","","",null,"","","",""]
[null,{"$f":"IF($A60=\"\",\"\",INDEX(Aggs,MATCH(TRUE,(AgMID=$A60),0),3))","v":""},{"$f":"IF($A60=\"\",\"\",INDEX(Aggs,MATCH(TRUE,(AgMID=$A60),0),8)&\" \"&INDEX(Aggs,MATCH(TRUE,(AgMID=$A60),0),9))","v":""},{"$f":"IF(B60=\"\",\"\",100-INDEX(Aggs,MATCH(TRUE,(AgMID=$A60),0),18))","v":""},{"$f":"IF(B60=\"\",\"\",100-INDEX(Aggs,MATCH(TRUE,(AgMID=$A60),0),19))","v":""},null,null,null,"","","","","+ #4","","",null,null,null,null,"","","","","",null,"","","",""]
[null,{"$f":"IF($A61=\"\",\"\",INDEX(Aggs,MATCH(TRUE,(AgMID=$A61),0),3))","v":""},{"$f":"IF($A61=\"\",\"\",INDEX(Aggs,MATCH(TRUE,(AgMID=$A61),0),8)&\" \"&INDEX(Aggs,MATCH(TRUE,(AgMID=$A61),0),9))","v":""},{"$f":"IF(B61=\"\",\"\",100-INDEX(Aggs,MATCH(TRUE,(AgMID=$A61),0),18))","v":""},{"$f":"IF(B61=\"\",\"\",100-INDEX(Aggs,MATCH(TRUE,(AgMID=$A61),0),19))","v":""},null,null,null,"","","","","+ #4","","",null,null,null,null,"","","","","",null,"","","",""]
[null,{"$f":"IF($A62=\"\",\"\",INDEX(Aggs,MATCH(TRUE,(AgMID=$A62),0),3))","v":""},{"$f":"IF($A62=\"\",\"\",INDEX(Aggs,MATCH(TRUE,(AgMID=$A62),0),8)&\" \"&INDEX(Aggs,MATCH(TRUE,(AgMID=$A62),0),9))","v":""},{"$f":"IF(B62=\"\",\"\",100-INDEX(Aggs,MATCH(TRUE,(AgMID=$A62),0),18))","v":""},{"$f":"IF(B62=\"\",\"\",100-INDEX(Aggs,MATCH(TRUE,(AgMID=$A62),0),19))","v":""},null,null,null,"","","","","+ #4","","",null,null,null,null,"","","","","",null,"","","",""]
[null,{"$f":"IF($A63=\"\",\"\",INDEX(Aggs,MATCH(TRUE,(AgMID=$A63),0),3))","v":""},{"$f":"IF($A63=\"\",\"\",INDEX(Aggs,MATCH(TRUE,(AgMID=$A63),0),8)&\" \"&INDEX(Aggs,MATCH(TRUE,(AgMID=$A63),0),9))","v":""},{"$f":"IF(B63=\"\",\"\",100-INDEX(Aggs,MATCH(TRUE,(AgMID=$A63),0),18))","v":""},{"$f":"IF(B63=\"\",\"\",100-INDEX(Aggs,MATCH(TRUE,(AgMID=$A63),0),19))","v":""},null,null,null,"","","","","+ #4","","",null,null,null,null,"","","","","",null,"","","",""]
[null,{"$f":"IF($A64=\"\",\"\",INDEX(Aggs,MATCH(TRUE,(AgMID=$A64),0),3))","v":""},{"$f":"IF($A64=\"\",\"\",INDEX(Aggs,MATCH(TRUE,(AgMID=$A64),0),8)&\" \"&INDEX(Aggs,MATCH(TRUE,(AgMID=$A64),0),9))","v":""},{"$f":"IF(B64=\"\",\"\",100-INDEX(Aggs,MATCH(TRUE,(AgMID=$A64),0),18))","v":""},{"$f":"IF(B64=\"\",\"\",100-INDEX(Aggs,MATCH(TRUE,(AgMID=$A64),0),19))","v":""},null,null,null,"","","","","+ #4","","",null,null,null,null,"","","","","",null,"","","",""]
[null,{"$f":"IF($A65=\"\",\"\",INDEX(Aggs,MATCH(TRUE,(AgMID=$A65),0),3))","v":""},{"$f":"IF($A65=\"\",\"\",INDEX(Aggs,MATCH(TRUE,(AgMID=$A65),0),8)&\" \"&INDEX(Aggs,MATCH(TRUE,(AgMID=$A65),0),9))","v":""},{"$f":"IF(B65=\"\",\"\",100-INDEX(Aggs,MATCH(TRUE,(AgMID=$A65),0),18))","v":""},{"$f":"IF(B65=\"\",\"\",100-INDEX(Aggs,MATCH(TRUE,(AgMID=$A65),0),19))","v":""},null,null,null,"","","","","+ #4","","",null,null,null,null,"","","","","",null,"","","",""]
[null,{"$f":"IF($A66=\"\",\"\",INDEX(Aggs,MATCH(TRUE,(AgMID=$A66),0),3))","v":""},{"$f":"IF($A66=\"\",\"\",INDEX(Aggs,MATCH(TRUE,(AgMID=$A66),0),8)&\" \"&INDEX(Aggs,MATCH(TRUE,(AgMID=$A66),0),9))","v":""},{"$f":"IF(B66=\"\",\"\",100-INDEX(Aggs,MATCH(TRUE,(AgMID=$A66),0),18))","v":""},{"$f":"IF(B66=\"\",\"\",100-INDEX(Aggs,MATCH(TRUE,(AgMID=$A66),0),19))","v":""},null,null,null,"","","","","+ #4","","",null,null,null,null,"","","","","",null,"","","",""]
[null,{"$f":"IF($A67=\"\",\"\",INDEX(Aggs,MATCH(TRUE,(AgMID=$A67),0),3))","v":""},{"$f":"IF($A67=\"\",\"\",INDEX(Aggs,MATCH(TRUE,(AgMID=$A67),0),8)&\" \"&INDEX(Aggs,MATCH(TRUE,(AgMID=$A67),0),9))","v":""},{"$f":"IF(B67=\"\",\"\",100-INDEX(Aggs,MATCH(TRUE,(AgMID=$A67),0),18))","v":""},{"$f":"IF(B67=\"\",\"\",100-INDEX(Aggs,MATCH(TRUE,(AgMID=$A67),0),19))","v":""},null,null,null,"","","","","+ #4","","",null,null,null,null,"","","","","",null,"","","",""]
[null,{"$f":"IF($A68=\"\",\"\",INDEX(Aggs,MATCH(TRUE,(AgMID=$A68),0),3))","v":""},{"$f":"IF($A68=\"\",\"\",INDEX(Aggs,MATCH(TRUE,(AgMID=$A68),0),8)&\" \"&INDEX(Aggs,MATCH(TRUE,(AgMID=$A68),0),9))","v":""},{"$f":"IF(B68=\"\",\"\",100-INDEX(Aggs,MATCH(TRUE,(AgMID=$A68),0),18))","v":""},{"$f":"IF(B68=\"\",\"\",100-INDEX(Aggs,MATCH(TRUE,(AgMID=$A68),0),19))","v":""},null,null,null,"","","","","+ #4","","",null,null,null,null,"","","","","",null,"","","",""]
[null,{"$f":"IF($A69=\"\",\"\",INDEX(Aggs,MATCH(TRUE,(AgMID=$A69),0),3))","v":""},{"$f":"IF($A69=\"\",\"\",INDEX(Aggs,MATCH(TRUE,(AgMID=$A69),0),8)&\" \"&INDEX(Aggs,MATCH(TRUE,(AgMID=$A69),0),9))","v":""},{"$f":"IF(B69=\"\",\"\",100-INDEX(Aggs,MATCH(TRUE,(AgMID=$A69),0),18))","v":""},{"$f":"IF(B69=\"\",\"\",100-INDEX(Aggs,MATCH(TRUE,(AgMID=$A69),0),19))","v":""},null,null,null,"","","","","+ #4","","",null,null,null,null,"","","","","",null,"","","",""]
[null,{"$f":"IF($A70=\"\",\"\",INDEX(Aggs,MATCH(TRUE,(AgMID=$A70),0),3))","v":""},{"$f":"IF($A70=\"\",\"\",INDEX(Aggs,MATCH(TRUE,(AgMID=$A70),0),8)&\" \"&INDEX(Aggs,MATCH(TRUE,(AgMID=$A70),0),9))","v":""},{"$f":"IF(B70=\"\",\"\",100-INDEX(Aggs,MATCH(TRUE,(AgMID=$A70),0),18))","v":""},{"$f":"IF(B70=\"\",\"\",100-INDEX(Aggs,MATCH(TRUE,(AgMID=$A70),0),19))","v":""},null,null,null,"","","","","+ #4","","",null,null,null,null,"","","","","",null,"","","",""]
[null,{"$f":"IF($A71=\"\",\"\",INDEX(Aggs,MATCH(TRUE,(AgMID=$A71),0),3))","v":""},{"$f":"IF($A71=\"\",\"\",INDEX(Aggs,MATCH(TRUE,(AgMID=$A71),0),8)&\" \"&INDEX(Aggs,MATCH(TRUE,(AgMID=$A71),0),9))","v":""},{"$f":"IF(B71=\"\",\"\",100-INDEX(Aggs,MATCH(TRUE,(AgMID=$A71),0),18))","v":""},{"$f":"IF(B71=\"\",\"\",100-INDEX(Aggs,MATCH(TRUE,(AgMID=$A71),0),19))","v":""},null,null,null,"","","","","+ #4","","",null,null,null,null,"","","","","",null,"","","",""]
[null,{"$f":"IF($A72=\"\",\"\",INDEX(Aggs,MATCH(TRUE,(AgMID=$A72),0),3))","v":""},{"$f":"IF($A72=\"\",\"\",INDEX(Aggs,MATCH(TRUE,(AgMID=$A72),0),8)&\" \"&INDEX(Aggs,MATCH(TRUE,(AgMID=$A72),0),9))","v":""},{"$f":"IF(B72=\"\",\"\",100-INDEX(Aggs,MATCH(TRUE,(AgMID=$A72),0),18))","v":""},{"$f":"IF(B72=\"\",\"\",100-INDEX(Aggs,MATCH(TRUE,(AgMID=$A72),0),19))","v":""},null,null,null,"","","","","+ #4","","",null,null,null,null,"","","","","",null,"","","",""]
[null,{"$f":"IF($A73=\"\",\"\",INDEX(Aggs,MATCH(TRUE,(AgMID=$A73),0),3))","v":""},{"$f":"IF($A73=\"\",\"\",INDEX(Aggs,MATCH(TRUE,(AgMID=$A73),0),8)&\" \"&INDEX(Aggs,MATCH(TRUE,(AgMID=$A73),0),9))","v":""},{"$f":"IF(B73=\"\",\"\",100-INDEX(Aggs,MATCH(TRUE,(AgMID=$A73),0),18))","v":""},{"$f":"IF(B73=\"\",\"\",100-INDEX(Aggs,MATCH(TRUE,(AgMID=$A73),0),19))","v":""},null,null,null,"","","","","+ #4","","",null,null,null,null,"","","","","",null,"","","",""]
[null,{"$f":"IF($A74=\"\",\"\",INDEX(Aggs,MATCH(TRUE,(AgMID=$A74),0),3))","v":""},{"$f":"IF($A74=\"\",\"\",INDEX(Aggs,MATCH(TRUE,(AgMID=$A74),0),8)&\" \"&INDEX(Aggs,MATCH(TRUE,(AgMID=$A74),0),9))","v":""},{"$f":"IF(B74=\"\",\"\",100-INDEX(Aggs,MATCH(TRUE,(AgMID=$A74),0),18))","v":""},{"$f":"IF(B74=\"\",\"\",100-INDEX(Aggs,MATCH(TRUE,(AgMID=$A74),0),19))","v":""},null,null,null,"","","","","+ #4","","",null,null,null,null,"","","","","",null,"","","",""]
[null,{"$f":"IF($A75=\"\",\"\",INDEX(Aggs,MATCH(TRUE,(AgMID=$A75),0),3))","v":""},{"$f":"IF($A75=\"\",\"\",INDEX(Aggs,MATCH(TRUE,(AgMID=$A75),0),8)&\" \"&INDEX(Aggs,MATCH(TRUE,(AgMID=$A75),0),9))","v":""},{"$f":"IF(B75=\"\",\"\",100-INDEX(Aggs,MATCH(TRUE,(AgMID=$A75),0),18))","v":""},{"$f":"IF(B75=\"\",\"\",100-INDEX(Aggs,MATCH(TRUE,(AgMID=$A75),0),19))","v":""},null,null,null,"","","","","+ #4","","",null,null,null,null,"","","","","",null,"","","",""]
[null,{"$f":"IF($A76=\"\",\"\",INDEX(Aggs,MATCH(TRUE,(AgMID=$A76),0),3))","v":""},{"$f":"IF($A76=\"\",\"\",INDEX(Aggs,MATCH(TRUE,(AgMID=$A76),0),8)&\" \"&INDEX(Aggs,MATCH(TRUE,(AgMID=$A76),0),9))","v":""},{"$f":"IF(B76=\"\",\"\",100-INDEX(Aggs,MATCH(TRUE,(AgMID=$A76),0),18))","v":""},{"$f":"IF(B76=\"\",\"\",100-INDEX(Aggs,MATCH(TRUE,(AgMID=$A76),0),19))","v":""},null,null,null,"","","","","+ #4","","",null,null,null,null,"","","","","",null,"","","",""]
[null,{"$f":"IF($A77=\"\",\"\",INDEX(Aggs,MATCH(TRUE,(AgMID=$A77),0),3))","v":""},{"$f":"IF($A77=\"\",\"\",INDEX(Aggs,MATCH(TRUE,(AgMID=$A77),0),8)&\" \"&INDEX(Aggs,MATCH(TRUE,(AgMID=$A77),0),9))","v":""},{"$f":"IF(B77=\"\",\"\",100-INDEX(Aggs,MATCH(TRUE,(AgMID=$A77),0),18))","v":""},{"$f":"IF(B77=\"\",\"\",100-INDEX(Aggs,MATCH(TRUE,(AgMID=$A77),0),19))","v":""},null,null,null,"","","","","+ #4","","",null,null,null,null,"","","","","",null,"","","",""]
[null,{"$f":"IF($A78=\"\",\"\",INDEX(Aggs,MATCH(TRUE,(AgMID=$A78),0),3))","v":""},{"$f":"IF($A78=\"\",\"\",INDEX(Aggs,MATCH(TRUE,(AgMID=$A78),0),8)&\" \"&INDEX(Aggs,MATCH(TRUE,(AgMID=$A78),0),9))","v":""},{"$f":"IF(B78=\"\",\"\",100-INDEX(Aggs,MATCH(TRUE,(AgMID=$A78),0),18))","v":""},{"$f":"IF(B78=\"\",\"\",100-INDEX(Aggs,MATCH(TRUE,(AgMID=$A78),0),19))","v":""},null,null,null,"","","","","+ #4","","",null,null,null,null,"","","","","",null,"","","",""]
[null,{"$f":"IF($A79=\"\",\"\",INDEX(Aggs,MATCH(TRUE,(AgMID=$A79),0),3))","v":""},{"$f":"IF($A79=\"\",\"\",INDEX(Aggs,MATCH(TRUE,(AgMID=$A79),0),8)&\" \"&INDEX(Aggs,MATCH(TRUE,(AgMID=$A79),0),9))","v":""},{"$f":"IF(B79=\"\",\"\",100-INDEX(Aggs,MATCH(TRUE,(AgMID=$A79),0),18))","v":""},{"$f":"IF(B79=\"\",\"\",100-INDEX(Aggs,MATCH(TRUE,(AgMID=$A79),0),19))","v":""},null,null,null,"","","","","+ #4","","",null,null,null,null,"","","","","",null,"","","",""]
[null,{"$f":"IF($A80=\"\",\"\",INDEX(Aggs,MATCH(TRUE,(AgMID=$A80),0),3))","v":""},{"$f":"IF($A80=\"\",\"\",INDEX(Aggs,MATCH(TRUE,(AgMID=$A80),0),8)&\" \"&INDEX(Aggs,MATCH(TRUE,(AgMID=$A80),0),9))","v":""},{"$f":"IF(B80=\"\",\"\",100-INDEX(Aggs,MATCH(TRUE,(AgMID=$A80),0),18))","v":""},{"$f":"IF(B80=\"\",\"\",100-INDEX(Aggs,MATCH(TRUE,(AgMID=$A80),0),19))","v":""},null,null,null,{"$f":"IFERROR(ROUND(H80/(H80-F80),3),\"\")","v":""},{"$f":"IFERROR(ROUND(G80/(G80-F80),3),\"\")","v":""},{"$f":"IFERROR(ROUND(H80/(G80-F80),3),\"\")","v":""},{"$f":"IFERROR(ROUND(100*(G80-H80)/H80,3),\"\")","v":""},{"$f":"IF(D80<30,\"FINE\",IF(AND(D80<70,E80>80),\"+ #8\",IF(E80<70,\"COMBINED\",\"+ #4\")))","v":"+ #4"},{"$f":"IF(B80=\"\",\"\",100-D80)","v":""},{"$f":"IF(C80=\"\",\"\",100-E80)","v":""},null,null,null,null,{"$f":"IF(R80=\"\",\"\",P80+Q80-R80)","v":""},{"$f":"IFERROR(ROUND(S80/(T80-(Q80-S80)),3),\"\")","v":""},{"$f":"IFERROR(ROUND(Q80/T80,3),\"\")","v":""},{"$f":"IFERROR(ROUND(S80/T80,3),\"\")","v":""},{"$f":"IFERROR(ROUND((Q80-S80)*100/S80,1),\"\")","v":""},null,{"$f":"IF(AND(I80=\"\",U80=\"\"),\"\",IF(U80=\"\",I80,IF(I80=\"\",U80,ROUND(IF($M80=\"+ #4\",100/($D80/I80+$N80/U80),100/($E80/I80+$O80/U80)),3))))","v":""},{"$f":"IF(AND(J80=\"\",V80=\"\"),\"\",IF(V80=\"\",J80,IF(J80=\"\",V80,ROUND(IF($M80=\"+ #4\",100/($D80/J80+$N80/V80),100/($E80/J80+$O80/V80)),3))))","v":""},{"$f":"IF(AND(K80=\"\",W80=\"\"),\"\",IF(W80=\"\",K80,IF(K80=\"\",W80,ROUND(IF($M80=\"+ #4\",100/($D80/K80+$N80/W80),100/($E80/K80+$O80/W80)),3))))","v":""},{"$f":"IF(AND(L80=\"\",X80=\"\"),\"\",IF(X80=\"\",L80,IF(L80=\"\",X80,ROUND(IF($M80=\"+ #4\",L80*D80/100+X80*N80/100,L80*E80/100+X80*O80/100),1))))","v":""}]
[null,{"$f":"IF($A81=\"\",\"\",INDEX(Aggs,MATCH(TRUE,(AgMID=$A81),0),3))","v":""},{"$f":"IF($A81=\"\",\"\",INDEX(Aggs,MATCH(TRUE,(AgMID=$A81),0),8)&\" \"&INDEX(Aggs,MATCH(TRUE,(AgMID=$A81),0),9))","v":""},{"$f":"IF(B81=\"\",\"\",100-INDEX(Aggs,MATCH(TRUE,(AgMID=$A81),0),18))","v":""},{"$f":"IF(B81=\"\",\"\",100-INDEX(Aggs,MATCH(TRUE,(AgMID=$A81),0),19))","v":""},null,null,null,"","","","","+ #4","","",null,null,null,null,"","","","","",null,"","","",""]
[null,{"$f":"IF($A82=\"\",\"\",INDEX(Aggs,MATCH(TRUE,(AgMID=$A82),0),3))","v":""},{"$f":"IF($A82=\"\",\"\",INDEX(Aggs,MATCH(TRUE,(AgMID=$A82),0),8)&\" \"&INDEX(Aggs,MATCH(TRUE,(AgMID=$A82),0),9))","v":""},{"$f":"IF(B82=\"\",\"\",100-INDEX(Aggs,MATCH(TRUE,(AgMID=$A82),0),18))","v":""},{"$f":"IF(B82=\"\",\"\",100-INDEX(Aggs,MATCH(TRUE,(AgMID=$A82),0),19))","v":""},null,null,null,"","","","","+ #4","","",null,null,null,null,"","","","","",null,"","","",""]
[null,{"$f":"IF($A83=\"\",\"\",INDEX(Aggs,MATCH(TRUE,(AgMID=$A83),0),3))","v":""},{"$f":"IF($A83=\"\",\"\",INDEX(Aggs,MATCH(TRUE,(AgMID=$A83),0),8)&\" \"&INDEX(Aggs,MATCH(TRUE,(AgMID=$A83),0),9))","v":""},{"$f":"IF(B83=\"\",\"\",100-INDEX(Aggs,MATCH(TRUE,(AgMID=$A83),0),18))","v":""},{"$f":"IF(B83=\"\",\"\",100-INDEX(Aggs,MATCH(TRUE,(AgMID=$A83),0),19))","v":""},null,null,null,"","","","","+ #4","","",null,null,null,null,"","","","","",null,"","","",""]
[null,{"$f":"IF($A84=\"\",\"\",INDEX(Aggs,MATCH(TRUE,(AgMID=$A84),0),3))","v":""},{"$f":"IF($A84=\"\",\"\",INDEX(Aggs,MATCH(TRUE,(AgMID=$A84),0),8)&\" \"&INDEX(Aggs,MATCH(TRUE,(AgMID=$A84),0),9))","v":""},{"$f":"IF(B84=\"\",\"\",100-INDEX(Aggs,MATCH(TRUE,(AgMID=$A84),0),18))","v":""},{"$f":"IF(B84=\"\",\"\",100-INDEX(Aggs,MATCH(TRUE,(AgMID=$A84),0),19))","v":""},null,null,null,"","","","","+ #4","","",null,null,null,null,"","","","","",null,"","","",""]
[null,{"$f":"IF($A85=\"\",\"\",INDEX(Aggs,MATCH(TRUE,(AgMID=$A85),0),3))","v":""},{"$f":"IF($A85=\"\",\"\",INDEX(Aggs,MATCH(TRUE,(AgMID=$A85),0),8)&\" \"&INDEX(Aggs,MATCH(TRUE,(AgMID=$A85),0),9))","v":""},{"$f":"IF(B85=\"\",\"\",100-INDEX(Aggs,MATCH(TRUE,(AgMID=$A85),0),18))","v":""},{"$f":"IF(B85=\"\",\"\",100-INDEX(Aggs,MATCH(TRUE,(AgMID=$A85),0),19))","v":""},null,null,null,"","","","","+ #4","","",null,null,null,null,"","","","","",null,"","","",""]
[null,{"$f":"IF($A86=\"\",\"\",INDEX(Aggs,MATCH(TRUE,(AgMID=$A86),0),3))","v":""},{"$f":"IF($A86=\"\",\"\",INDEX(Aggs,MATCH(TRUE,(AgMID=$A86),0),8)&\" \"&INDEX(Aggs,MATCH(TRUE,(AgMID=$A86),0),9))","v":""},{"$f":"IF(B86=\"\",\"\",100-INDEX(Aggs,MATCH(TRUE,(AgMID=$A86),0),18))","v":""},{"$f":"IF(B86=\"\",\"\",100-INDEX(Aggs,MATCH(TRUE,(AgMID=$A86),0),19))","v":""},null,null,null,"","","","","+ #4","","",null,null,null,null,"","","","","",null,"","","",""]
[null,{"$f":"IF($A87=\"\",\"\",INDEX(Aggs,MATCH(TRUE,(AgMID=$A87),0),3))","v":""},{"$f":"IF($A87=\"\",\"\",INDEX(Aggs,MATCH(TRUE,(AgMID=$A87),0),8)&\" \"&INDEX(Aggs,MATCH(TRUE,(AgMID=$A87),0),9))","v":""},{"$f":"IF(B87=\"\",\"\",100-INDEX(Aggs,MATCH(TRUE,(AgMID=$A87),0),18))","v":""},{"$f":"IF(B87=\"\",\"\",100-INDEX(Aggs,MATCH(TRUE,(AgMID=$A87),0),19))","v":""},null,null,null,"","","","","+ #4","","",null,null,null,null,"","","","","",null,"","","",""]
[null,{"$f":"IF($A88=\"\",\"\",INDEX(Aggs,MATCH(TRUE,(AgMID=$A88),0),3))","v":""},{"$f":"IF($A88=\"\",\"\",INDEX(Aggs,MATCH(TRUE,(AgMID=$A88),0),8)&\" \"&INDEX(Aggs,MATCH(TRUE,(AgMID=$A88),0),9))","v":""},{"$f":"IF(B88=\"\",\"\",100-INDEX(Aggs,MATCH(TRUE,(AgMID=$A88),0),18))","v":""},{"$f":"IF(B88=\"\",\"\",100-INDEX(Aggs,MATCH(TRUE,(AgMID=$A88),0),19))","v":""},null,null,null,"","","","","+ #4","","",null,null,null,null,"","","","","",null,"","","",""]
[null,{"$f":"IF($A89=\"\",\"\",INDEX(Aggs,MATCH(TRUE,(AgMID=$A89),0),3))","v":""},{"$f":"IF($A89=\"\",\"\",INDEX(Aggs,MATCH(TRUE,(AgMID=$A89),0),8)&\" \"&INDEX(Aggs,MATCH(TRUE,(AgMID=$A89),0),9))","v":""},{"$f":"IF(B89=\"\",\"\",100-INDEX(Aggs,MATCH(TRUE,(AgMID=$A89),0),18))","v":""},{"$f":"IF(B89=\"\",\"\",100-INDEX(Aggs,MATCH(TRUE,(AgMID=$A89),0),19))","v":""},null,null,null,"","","","","+ #4","","",null,null,null,null,"","","","","",null,"","","",""]
[null,{"$f":"IF($A90=\"\",\"\",INDEX(Aggs,MATCH(TRUE,(AgMID=$A90),0),3))","v":""},{"$f":"IF($A90=\"\",\"\",INDEX(Aggs,MATCH(TRUE,(AgMID=$A90),0),8)&\" \"&INDEX(Aggs,MATCH(TRUE,(AgMID=$A90),0),9))","v":""},{"$f":"IF(B90=\"\",\"\",100-INDEX(Aggs,MATCH(TRUE,(AgMID=$A90),0),18))","v":""},{"$f":"IF(B90=\"\",\"\",100-INDEX(Aggs,MATCH(TRUE,(AgMID=$A90),0),19))","v":""},null,null,null,"","","","","+ #4","","",null,null,null,null,"","","","","",null,"","","",""]
[null,{"$f":"IF($A91=\"\",\"\",INDEX(Aggs,MATCH(TRUE,(AgMID=$A91),0),3))","v":""},{"$f":"IF($A91=\"\",\"\",INDEX(Aggs,MATCH(TRUE,(AgMID=$A91),0),8)&\" \"&INDEX(Aggs,MATCH(TRUE,(AgMID=$A91),0),9))","v":""},{"$f":"IF(B91=\"\",\"\",100-INDEX(Aggs,MATCH(TRUE,(AgMID=$A91),0),18))","v":""},{"$f":"IF(B91=\"\",\"\",100-INDEX(Aggs,MATCH(TRUE,(AgMID=$A91),0),19))","v":""},null,null,null,"","","","","+ #4","","",null,null,null,null,"","","","","",null,"","","",""]
[null,{"$f":"IF($A92=\"\",\"\",INDEX(Aggs,MATCH(TRUE,(AgMID=$A92),0),3))","v":""},{"$f":"IF($A92=\"\",\"\",INDEX(Aggs,MATCH(TRUE,(AgMID=$A92),0),8)&\" \"&INDEX(Aggs,MATCH(TRUE,(AgMID=$A92),0),9))","v":""},{"$f":"IF(B92=\"\",\"\",100-INDEX(Aggs,MATCH(TRUE,(AgMID=$A92),0),18))","v":""},{"$f":"IF(B92=\"\",\"\",100-INDEX(Aggs,MATCH(TRUE,(AgMID=$A92),0),19))","v":""},null,null,null,"","","","","+ #4","","",null,null,null,null,"","","","","",null,"","","",""]
[null,{"$f":"IF($A93=\"\",\"\",INDEX(Aggs,MATCH(TRUE,(AgMID=$A93),0),3))","v":""},{"$f":"IF($A93=\"\",\"\",INDEX(Aggs,MATCH(TRUE,(AgMID=$A93),0),8)&\" \"&INDEX(Aggs,MATCH(TRUE,(AgMID=$A93),0),9))","v":""},{"$f":"IF(B93=\"\",\"\",100-INDEX(Aggs,MATCH(TRUE,(AgMID=$A93),0),18))","v":""},{"$f":"IF(B93=\"\",\"\",100-INDEX(Aggs,MATCH(TRUE,(AgMID=$A93),0),19))","v":""},null,null,null,"","","","","+ #4","","",null,null,null,null,"","","","","",null,"","","",""]
[null,{"$f":"IF($A94=\"\",\"\",INDEX(Aggs,MATCH(TRUE,(AgMID=$A94),0),3))","v":""},{"$f":"IF($A94=\"\",\"\",INDEX(Aggs,MATCH(TRUE,(AgMID=$A94),0),8)&\" \"&INDEX(Aggs,MATCH(TRUE,(AgMID=$A94),0),9))","v":""},{"$f":"IF(B94=\"\",\"\",100-INDEX(Aggs,MATCH(TRUE,(AgMID=$A94),0),18))","v":""},{"$f":"IF(B94=\"\",\"\",100-INDEX(Aggs,MATCH(TRUE,(AgMID=$A94),0),19))","v":""},null,null,null,"","","","","+ #4","","",null,null,null,null,"","","","","",null,"","","",""]
[null,{"$f":"IF($A95=\"\",\"\",INDEX(Aggs,MATCH(TRUE,(AgMID=$A95),0),3))","v":""},{"$f":"IF($A95=\"\",\"\",INDEX(Aggs,MATCH(TRUE,(AgMID=$A95),0),8)&\" \"&INDEX(Aggs,MATCH(TRUE,(AgMID=$A95),0),9))","v":""},{"$f":"IF(B95=\"\",\"\",100-INDEX(Aggs,MATCH(TRUE,(AgMID=$A95),0),18))","v":""},{"$f":"IF(B95=\"\",\"\",100-INDEX(Aggs,MATCH(TRUE,(AgMID=$A95),0),19))","v":""},null,null,null,"","","","","+ #4","","",null,null,null,null,"","","","","",null,"","","",""]
[null,{"$f":"IF($A96=\"\",\"\",INDEX(Aggs,MATCH(TRUE,(AgMID=$A96),0),3))","v":""},{"$f":"IF($A96=\"\",\"\",INDEX(Aggs,MATCH(TRUE,(AgMID=$A96),0),8)&\" \"&INDEX(Aggs,MATCH(TRUE,(AgMID=$A96),0),9))","v":""},{"$f":"IF(B96=\"\",\"\",100-INDEX(Aggs,MATCH(TRUE,(AgMID=$A96),0),18))","v":""},{"$f":"IF(B96=\"\",\"\",100-INDEX(Aggs,MATCH(TRUE,(AgMID=$A96),0),19))","v":""},null,null,null,"","","","","+ #4","","",null,null,null,null,"","","","","",null,"","","",""]
[null,{"$f":"IF($A97=\"\",\"\",INDEX(Aggs,MATCH(TRUE,(AgMID=$A97),0),3))","v":""},{"$f":"IF($A97=\"\",\"\",INDEX(Aggs,MATCH(TRUE,(AgMID=$A97),0),8)&\" \"&INDEX(Aggs,MATCH(TRUE,(AgMID=$A97),0),9))","v":""},{"$f":"IF(B97=\"\",\"\",100-INDEX(Aggs,MATCH(TRUE,(AgMID=$A97),0),18))","v":""},{"$f":"IF(B97=\"\",\"\",100-INDEX(Aggs,MATCH(TRUE,(AgMID=$A97),0),19))","v":""},null,null,null,"","","","","+ #4","","",null,null,null,null,"","","","","",null,"","","",""]
[null,{"$f":"IF($A98=\"\",\"\",INDEX(Aggs,MATCH(TRUE,(AgMID=$A98),0),3))","v":""},{"$f":"IF($A98=\"\",\"\",INDEX(Aggs,MATCH(TRUE,(AgMID=$A98),0),8)&\" \"&INDEX(Aggs,MATCH(TRUE,(AgMID=$A98),0),9))","v":""},{"$f":"IF(B98=\"\",\"\",100-INDEX(Aggs,MATCH(TRUE,(AgMID=$A98),0),18))","v":""},{"$f":"IF(B98=\"\",\"\",100-INDEX(Aggs,MATCH(TRUE,(AgMID=$A98),0),19))","v":""},null,null,null,"","","","","+ #4","","",null,null,null,null,"","","","","",null,"","","",""]
[null,{"$f":"IF($A99=\"\",\"\",INDEX(Aggs,MATCH(TRUE,(AgMID=$A99),0),3))","v":""},{"$f":"IF($A99=\"\",\"\",INDEX(Aggs,MATCH(TRUE,(AgMID=$A99),0),8)&\" \"&INDEX(Aggs,MATCH(TRUE,(AgMID=$A99),0),9))","v":""},{"$f":"IF(B99=\"\",\"\",100-INDEX(Aggs,MATCH(TRUE,(AgMID=$A99),0),18))","v":""},{"$f":"IF(B99=\"\",\"\",100-INDEX(Aggs,MATCH(TRUE,(AgMID=$A99),0),19))","v":""},null,null,null,"","","","","+ #4","","",null,null,null,null,"","","","","",null,"","","",""]
[null,{"$f":"IF($A100=\"\",\"\",INDEX(Aggs,MATCH(TRUE,(AgMID=$A100),0),3))","v":""},{"$f":"IF($A100=\"\",\"\",INDEX(Aggs,MATCH(TRUE,(AgMID=$A100),0),8)&\" \"&INDEX(Aggs,MATCH(TRUE,(AgMID=$A100),0),9))","v":""},{"$f":"IF(B100=\"\",\"\",100-INDEX(Aggs,MATCH(TRUE,(AgMID=$A100),0),18))","v":""},{"$f":"IF(B100=\"\",\"\",100-INDEX(Aggs,MATCH(TRUE,(AgMID=$A100),0),19))","v":""},null,null,null,"","","","","+ #4","","",null,null,null,null,"","","","","",null,"","","",""]
[null,{"$f":"IF($A101=\"\",\"\",INDEX(Aggs,MATCH(TRUE,(AgMID=$A101),0),3))","v":""},{"$f":"IF($A101=\"\",\"\",INDEX(Aggs,MATCH(TRUE,(AgMID=$A101),0),8)&\" \"&INDEX(Aggs,MATCH(TRUE,(AgMID=$A101),0),9))","v":""},{"$f":"IF(B101=\"\",\"\",100-INDEX(Aggs,MATCH(TRUE,(AgMID=$A101),0),18))","v":""},{"$f":"IF(B101=\"\",\"\",100-INDEX(Aggs,MATCH(TRUE,(AgMID=$A101),0),19))","v":""},null,null,null,{"$f":"IFERROR(ROUND(H101/(H101-F101),3),\"\")","v":""},{"$f":"IFERROR(ROUND(G101/(G101-F101),3),\"\")","v":""},{"$f":"IFERROR(ROUND(H101/(G101-F101),3),\"\")","v":""},{"$f":"IFERROR(ROUND(100*(G101-H101)/H101,3),\"\")","v":""},{"$f":"IF(D101<30,\"FINE\",IF(AND(D101<70,E101>80),\"+ #8\",IF(E101<70,\"COMBINED\",\"+ #4\")))","v":"+ #4"},{"$f":"IF(B101=\"\",\"\",100-D101)","v":""},{"$f":"IF(C101=\"\",\"\",100-E101)","v":""},null,null,null,null,{"$f":"IF(R101=\"\",\"\",P101+Q101-R101)","v":""},{"$f":"IFERROR(ROUND(S101/(T101-(Q101-S101)),3),\"\")","v":""},{"$f":"IFERROR(ROUND(Q101/T101,3),\"\")","v":""},{"$f":"IFERROR(ROUND(S101/T101,3),\"\")","v":""},{"$f":"IFERROR(ROUND((Q101-S101)*100/S101,1),\"\")","v":""},null,{"$f":"IF(AND(I101=\"\",U101=\"\"),\"\",IF(U101=\"\",I101,IF(I101=\"\",U101,ROUND(IF($M101=\"+ #4\",100/($D101/I101+$N101/U101),100/($E101/I101+$O101/U101)),3))))","v":""},{"$f":"IF(AND(J101=\"\",V101=\"\"),\"\",IF(V101=\"\",J101,IF(J101=\"\",V101,ROUND(IF($M101=\"+ #4\",100/($D101/J101+$N101/V101),100/($E101/J101+$O101/V101)),3))))","v":""},{"$f":"IF(AND(K101=\"\",W101=\"\"),\"\",IF(W101=\"\",K101,IF(K101=\"\",W101,ROUND(IF($M101=\"+ #4\",100/($D101/K101+$N101/W101),100/($E101/K101+$O101/W101)),3))))","v":""},{"$f":"IF(AND(L101=\"\",X101=\"\"),\"\",IF(X101=\"\",L101,IF(L101=\"\",X101,ROUND(IF($M101=\"+ #4\",L101*D101/100+X101*N101/100,L101*E101/100+X101*O101/100),1))))","v":""}]
[null,{"$f":"IF($A102=\"\",\"\",INDEX(Aggs,MATCH(TRUE,(AgMID=$A102),0),3))","v":""},{"$f":"IF($A102=\"\",\"\",INDEX(Aggs,MATCH(TRUE,(AgMID=$A102),0),8)&\" \"&INDEX(Aggs,MATCH(TRUE,(AgMID=$A102),0),9))","v":""},{"$f":"IF(B102=\"\",\"\",100-INDEX(Aggs,MATCH(TRUE,(AgMID=$A102),0),18))","v":""},{"$f":"IF(B102=\"\",\"\",100-INDEX(Aggs,MATCH(TRUE,(AgMID=$A102),0),19))","v":""},null,null,null,"","","","","+ #4","","",null,null,null,null,"","","","","",null,"","","",""]
[null,{"$f":"IF($A103=\"\",\"\",INDEX(Aggs,MATCH(TRUE,(AgMID=$A103),0),3))","v":""},{"$f":"IF($A103=\"\",\"\",INDEX(Aggs,MATCH(TRUE,(AgMID=$A103),0),8)&\" \"&INDEX(Aggs,MATCH(TRUE,(AgMID=$A103),0),9))","v":""},{"$f":"IF(B103=\"\",\"\",100-INDEX(Aggs,MATCH(TRUE,(AgMID=$A103),0),18))","v":""},{"$f":"IF(B103=\"\",\"\",100-INDEX(Aggs,MATCH(TRUE,(AgMID=$A103),0),19))","v":""},null,null,null,"","","","","+ #4","","",null,null,null,null,"","","","","",null,"","","",""]
[null,{"$f":"IF($A104=\"\",\"\",INDEX(Aggs,MATCH(TRUE,(AgMID=$A104),0),3))","v":""},{"$f":"IF($A104=\"\",\"\",INDEX(Aggs,MATCH(TRUE,(AgMID=$A104),0),8)&\" \"&INDEX(Aggs,MATCH(TRUE,(AgMID=$A104),0),9))","v":""},{"$f":"IF(B104=\"\",\"\",100-INDEX(Aggs,MATCH(TRUE,(AgMID=$A104),0),18))","v":""},{"$f":"IF(B104=\"\",\"\",100-INDEX(Aggs,MATCH(TRUE,(AgMID=$A104),0),19))","v":""},null,null,null,"","","","","+ #4","","",null,null,null,null,"","","","","",null,"","","",""]
[null,{"$f":"IF($A105=\"\",\"\",INDEX(Aggs,MATCH(TRUE,(AgMID=$A105),0),3))","v":""},{"$f":"IF($A105=\"\",\"\",INDEX(Aggs,MATCH(TRUE,(AgMID=$A105),0),8)&\" \"&INDEX(Aggs,MATCH(TRUE,(AgMID=$A105),0),9))","v":""},{"$f":"IF(B105=\"\",\"\",100-INDEX(Aggs,MATCH(TRUE,(AgMID=$A105),0),18))","v":""},{"$f":"IF(B105=\"\",\"\",100-INDEX(Aggs,MATCH(TRUE,(AgMID=$A105),0),19))","v":""},null,null,null,"","","","","+ #4","","",null,null,null,null,"","","","","",null,"","","",""]
[null,{"$f":"IF($A106=\"\",\"\",INDEX(Aggs,MATCH(TRUE,(AgMID=$A106),0),3))","v":""},{"$f":"IF($A106=\"\",\"\",INDEX(Aggs,MATCH(TRUE,(AgMID=$A106),0),8)&\" \"&INDEX(Aggs,MATCH(TRUE,(AgMID=$A106),0),9))","v":""},{"$f":"IF(B106=\"\",\"\",100-INDEX(Aggs,MATCH(TRUE,(AgMID=$A106),0),18))","v":""},{"$f":"IF(B106=\"\",\"\",100-INDEX(Aggs,MATCH(TRUE,(AgMID=$A106),0),19))","v":""},null,null,null,"","","","","+ #4","","",null,null,null,null,"","","","","",null,"","","",""]
[null,{"$f":"IF($A107=\"\",\"\",INDEX(Aggs,MATCH(TRUE,(AgMID=$A107),0),3))","v":""},{"$f":"IF($A107=\"\",\"\",INDEX(Aggs,MATCH(TRUE,(AgMID=$A107),0),8)&\" \"&INDEX(Aggs,MATCH(TRUE,(AgMID=$A107),0),9))","v":""},{"$f":"IF(B107=\"\",\"\",100-INDEX(Aggs,MATCH(TRUE,(AgMID=$A107),0),18))","v":""},{"$f":"IF(B107=\"\",\"\",100-INDEX(Aggs,MATCH(TRUE,(AgMID=$A107),0),19))","v":""},null,null,null,"","","","","+ #4","","",null,null,null,null,"","","","","",null,"","","",""]
[null,{"$f":"IF($A108=\"\",\"\",INDEX(Aggs,MATCH(TRUE,(AgMID=$A108),0),3))","v":""},{"$f":"IF($A108=\"\",\"\",INDEX(Aggs,MATCH(TRUE,(AgMID=$A108),0),8)&\" \"&INDEX(Aggs,MATCH(TRUE,(AgMID=$A108),0),9))","v":""},{"$f":"IF(B108=\"\",\"\",100-INDEX(Aggs,MATCH(TRUE,(AgMID=$A108),0),18))","v":""},{"$f":"IF(B108=\"\",\"\",100-INDEX(Aggs,MATCH(TRUE,(AgMID=$A108),0),19))","v":""},null,null,null,"","","","","+ #4","","",null,null,null,null,"","","","","",null,"","","",""]
[null,{"$f":"IF($A109=\"\",\"\",INDEX(Aggs,MATCH(TRUE,(AgMID=$A109),0),3))","v":""},{"$f":"IF($A109=\"\",\"\",INDEX(Aggs,MATCH(TRUE,(AgMID=$A109),0),8)&\" \"&INDEX(Aggs,MATCH(TRUE,(AgMID=$A109),0),9))","v":""},{"$f":"IF(B109=\"\",\"\",100-INDEX(Aggs,MATCH(TRUE,(AgMID=$A109),0),18))","v":""},{"$f":"IF(B109=\"\",\"\",100-INDEX(Aggs,MATCH(TRUE,(AgMID=$A109),0),19))","v":""},null,null,null,"","","","","+ #4","","",null,null,null,null,"","","","","",null,"","","",""]
[null,{"$f":"IF($A110=\"\",\"\",INDEX(Aggs,MATCH(TRUE,(AgMID=$A110),0),3))","v":""},{"$f":"IF($A110=\"\",\"\",INDEX(Aggs,MATCH(TRUE,(AgMID=$A110),0),8)&\" \"&INDEX(Aggs,MATCH(TRUE,(AgMID=$A110),0),9))","v":""},{"$f":"IF(B110=\"\",\"\",100-INDEX(Aggs,MATCH(TRUE,(AgMID=$A110),0),18))","v":""},{"$f":"IF(B110=\"\",\"\",100-INDEX(Aggs,MATCH(TRUE,(AgMID=$A110),0),19))","v":""},null,null,null,"","","","","+ #4","","",null,null,null,null,"","","","","",null,"","","",""]
[null,{"$f":"IF($A111=\"\",\"\",INDEX(Aggs,MATCH(TRUE,(AgMID=$A111),0),3))","v":""},{"$f":"IF($A111=\"\",\"\",INDEX(Aggs,MATCH(TRUE,(AgMID=$A111),0),8)&\" \"&INDEX(Aggs,MATCH(TRUE,(AgMID=$A111),0),9))","v":""},{"$f":"IF(B111=\"\",\"\",100-INDEX(Aggs,MATCH(TRUE,(AgMID=$A111),0),18))","v":""},{"$f":"IF(B111=\"\",\"\",100-INDEX(Aggs,MATCH(TRUE,(AgMID=$A111),0),19))","v":""},null,null,null,"","","","","+ #4","","",null,null,null,null,"","","","","",null,"","","",""]
[null,{"$f":"IF($A112=\"\",\"\",INDEX(Aggs,MATCH(TRUE,(AgMID=$A112),0),3))","v":""},{"$f":"IF($A112=\"\",\"\",INDEX(Aggs,MATCH(TRUE,(AgMID=$A112),0),8)&\" \"&INDEX(Aggs,MATCH(TRUE,(AgMID=$A112),0),9))","v":""},{"$f":"IF(B112=\"\",\"\",100-INDEX(Aggs,MATCH(TRUE,(AgMID=$A112),0),18))","v":""},{"$f":"IF(B112=\"\",\"\",100-INDEX(Aggs,MATCH(TRUE,(AgMID=$A112),0),19))","v":""},null,null,null,"","","","","+ #4","","",null,null,null,null,"","","","","",null,"","","",""]
[null,{"$f":"IF($A113=\"\",\"\",INDEX(Aggs,MATCH(TRUE,(AgMID=$A113),0),3))","v":""},{"$f":"IF($A113=\"\",\"\",INDEX(Aggs,MATCH(TRUE,(AgMID=$A113),0),8)&\" \"&INDEX(Aggs,MATCH(TRUE,(AgMID=$A113),0),9))","v":""},{"$f":"IF(B113=\"\",\"\",100-INDEX(Aggs,MATCH(TRUE,(AgMID=$A113),0),18))","v":""},{"$f":"IF(B113=\"\",\"\",100-INDEX(Aggs,MATCH(TRUE,(AgMID=$A113),0),19))","v":""},null,null,null,"","","","","+ #4","","",null,null,null,null,"","","","","",null,"","","",""]
[null,{"$f":"IF($A114=\"\",\"\",INDEX(Aggs,MATCH(TRUE,(AgMID=$A114),0),3))","v":""},{"$f":"IF($A114=\"\",\"\",INDEX(Aggs,MATCH(TRUE,(AgMID=$A114),0),8)&\" \"&INDEX(Aggs,MATCH(TRUE,(AgMID=$A114),0),9))","v":""},{"$f":"IF(B114=\"\",\"\",100-INDEX(Aggs,MATCH(TRUE,(AgMID=$A114),0),18))","v":""},{"$f":"IF(B114=\"\",\"\",100-INDEX(Aggs,MATCH(TRUE,(AgMID=$A114),0),19))","v":""},null,null,null,"","","","","+ #4","","",null,null,null,null,"","","","","",null,"","","",""]
[null,{"$f":"IF($A115=\"\",\"\",INDEX(Aggs,MATCH(TRUE,(AgMID=$A115),0),3))","v":""},{"$f":"IF($A115=\"\",\"\",INDEX(Aggs,MATCH(TRUE,(AgMID=$A115),0),8)&\" \"&INDEX(Aggs,MATCH(TRUE,(AgMID=$A115),0),9))","v":""},{"$f":"IF(B115=\"\",\"\",100-INDEX(Aggs,MATCH(TRUE,(AgMID=$A115),0),18))","v":""},{"$f":"IF(B115=\"\",\"\",100-INDEX(Aggs,MATCH(TRUE,(AgMID=$A115),0),19))","v":""},null,null,null,"","","","","+ #4","","",null,null,null,null,"","","","","",null,"","","",""]
[null,{"$f":"IF($A116=\"\",\"\",INDEX(Aggs,MATCH(TRUE,(AgMID=$A116),0),3))","v":""},{"$f":"IF($A116=\"\",\"\",INDEX(Aggs,MATCH(TRUE,(AgMID=$A116),0),8)&\" \"&INDEX(Aggs,MATCH(TRUE,(AgMID=$A116),0),9))","v":""},{"$f":"IF(B116=\"\",\"\",100-INDEX(Aggs,MATCH(TRUE,(AgMID=$A116),0),18))","v":""},{"$f":"IF(B116=\"\",\"\",100-INDEX(Aggs,MATCH(TRUE,(AgMID=$A116),0),19))","v":""},null,null,null,"","","","","+ #4","","",null,null,null,null,"","","","","",null,"","","",""]
[null,{"$f":"IF($A117=\"\",\"\",INDEX(Aggs,MATCH(TRUE,(AgMID=$A117),0),3))","v":""},{"$f":"IF($A117=\"\",\"\",INDEX(Aggs,MATCH(TRUE,(AgMID=$A117),0),8)&\" \"&INDEX(Aggs,MATCH(TRUE,(AgMID=$A117),0),9))","v":""},{"$f":"IF(B117=\"\",\"\",100-INDEX(Aggs,MATCH(TRUE,(AgMID=$A117),0),18))","v":""},{"$f":"IF(B117=\"\",\"\",100-INDEX(Aggs,MATCH(TRUE,(AgMID=$A117),0),19))","v":""},null,null,null,"","","","","+ #4","","",null,null,null,null,"","","","","",null,"","","",""]
[null,{"$f":"IF($A118=\"\",\"\",INDEX(Aggs,MATCH(TRUE,(AgMID=$A118),0),3))","v":""},{"$f":"IF($A118=\"\",\"\",INDEX(Aggs,MATCH(TRUE,(AgMID=$A118),0),8)&\" \"&INDEX(Aggs,MATCH(TRUE,(AgMID=$A118),0),9))","v":""},{"$f":"IF(B118=\"\",\"\",100-INDEX(Aggs,MATCH(TRUE,(AgMID=$A118),0),18))","v":""},{"$f":"IF(B118=\"\",\"\",100-INDEX(Aggs,MATCH(TRUE,(AgMID=$A118),0),19))","v":""},null,null,null,"","","","","+ #4","","",null,null,null,null,"","","","","",null,"","","",""]
[null,{"$f":"IF($A119=\"\",\"\",INDEX(Aggs,MATCH(TRUE,(AgMID=$A119),0),3))","v":""},{"$f":"IF($A119=\"\",\"\",INDEX(Aggs,MATCH(TRUE,(AgMID=$A119),0),8)&\" \"&INDEX(Aggs,MATCH(TRUE,(AgMID=$A119),0),9))","v":""},{"$f":"IF(B119=\"\",\"\",100-INDEX(Aggs,MATCH(TRUE,(AgMID=$A119),0),18))","v":""},{"$f":"IF(B119=\"\",\"\",100-INDEX(Aggs,MATCH(TRUE,(AgMID=$A119),0),19))","v":""},null,null,null,"","","","","+ #4","","",null,null,null,null,"","","","","",null,"","","",""]
[null,{"$f":"IF($A120=\"\",\"\",INDEX(Aggs,MATCH(TRUE,(AgMID=$A120),0),3))","v":""},{"$f":"IF($A120=\"\",\"\",INDEX(Aggs,MATCH(TRUE,(AgMID=$A120),0),8)&\" \"&INDEX(Aggs,MATCH(TRUE,(AgMID=$A120),0),9))","v":""},{"$f":"IF(B120=\"\",\"\",100-INDEX(Aggs,MATCH(TRUE,(AgMID=$A120),0),18))","v":""},{"$f":"IF(B120=\"\",\"\",100-INDEX(Aggs,MATCH(TRUE,(AgMID=$A120),0),19))","v":""},null,null,null,"","","","","+ #4","","",null,null,null,null,"","","","","",null,"","","",""]
[null,{"$f":"IF($A121=\"\",\"\",INDEX(Aggs,MATCH(TRUE,(AgMID=$A121),0),3))","v":""},{"$f":"IF($A121=\"\",\"\",INDEX(Aggs,MATCH(TRUE,(AgMID=$A121),0),8)&\" \"&INDEX(Aggs,MATCH(TRUE,(AgMID=$A121),0),9))","v":""},{"$f":"IF(B121=\"\",\"\",100-INDEX(Aggs,MATCH(TRUE,(AgMID=$A121),0),18))","v":""},{"$f":"IF(B121=\"\",\"\",100-INDEX(Aggs,MATCH(TRUE,(AgMID=$A121),0),19))","v":""},null,null,null,"","","","","+ #4","","",null,null,null,null,"","","","","",null,"","","",""]
[null,{"$f":"IF($A122=\"\",\"\",INDEX(Aggs,MATCH(TRUE,(AgMID=$A122),0),3))","v":""},{"$f":"IF($A122=\"\",\"\",INDEX(Aggs,MATCH(TRUE,(AgMID=$A122),0),8)&\" \"&INDEX(Aggs,MATCH(TRUE,(AgMID=$A122),0),9))","v":""},{"$f":"IF(B122=\"\",\"\",100-INDEX(Aggs,MATCH(TRUE,(AgMID=$A122),0),18))","v":""},{"$f":"IF(B122=\"\",\"\",100-INDEX(Aggs,MATCH(TRUE,(AgMID=$A122),0),19))","v":""},null,null,null,"","","","","+ #4","","",null,null,null,null,"","","","","",null,"","","",""]
[null,{"$f":"IF($A123=\"\",\"\",INDEX(Aggs,MATCH(TRUE,(AgMID=$A123),0),3))","v":""},{"$f":"IF($A123=\"\",\"\",INDEX(Aggs,MATCH(TRUE,(AgMID=$A123),0),8)&\" \"&INDEX(Aggs,MATCH(TRUE,(AgMID=$A123),0),9))","v":""},{"$f":"IF(B123=\"\",\"\",100-INDEX(Aggs,MATCH(TRUE,(AgMID=$A123),0),18))","v":""},{"$f":"IF(B123=\"\",\"\",100-INDEX(Aggs,MATCH(TRUE,(AgMID=$A123),0),19))","v":""},null,null,null,"","","","","+ #4","","",null,null,null,null,"","","","","",null,"","","",""]
[null,{"$f":"IF($A124=\"\",\"\",INDEX(Aggs,MATCH(TRUE,(AgMID=$A124),0),3))","v":""},{"$f":"IF($A124=\"\",\"\",INDEX(Aggs,MATCH(TRUE,(AgMID=$A124),0),8)&\" \"&INDEX(Aggs,MATCH(TRUE,(AgMID=$A124),0),9))","v":""},{"$f":"IF(B124=\"\",\"\",100-INDEX(Aggs,MATCH(TRUE,(AgMID=$A124),0),18))","v":""},{"$f":"IF(B124=\"\",\"\",100-INDEX(Aggs,MATCH(TRUE,(AgMID=$A124),0),19))","v":""},null,null,null,"","","","","+ #4","","",null,null,null,null,"","","","","",null,"","","",""]
[null,{"$f":"IF($A125=\"\",\"\",INDEX(Aggs,MATCH(TRUE,(AgMID=$A125),0),3))","v":""},{"$f":"IF($A125=\"\",\"\",INDEX(Aggs,MATCH(TRUE,(AgMID=$A125),0),8)&\" \"&INDEX(Aggs,MATCH(TRUE,(AgMID=$A125),0),9))","v":""},{"$f":"IF(B125=\"\",\"\",100-INDEX(Aggs,MATCH(TRUE,(AgMID=$A125),0),18))","v":""},{"$f":"IF(B125=\"\",\"\",100-INDEX(Aggs,MATCH(TRUE,(AgMID=$A125),0),19))","v":""},null,null,null,"","","","","+ #4","","",null,null,null,null,"","","","","",null,"","","",""]
[null,{"$f":"IF($A126=\"\",\"\",INDEX(Aggs,MATCH(TRUE,(AgMID=$A126),0),3))","v":""},{"$f":"IF($A126=\"\",\"\",INDEX(Aggs,MATCH(TRUE,(AgMID=$A126),0),8)&\" \"&INDEX(Aggs,MATCH(TRUE,(AgMID=$A126),0),9))","v":""},{"$f":"IF(B126=\"\",\"\",100-INDEX(Aggs,MATCH(TRUE,(AgMID=$A126),0),18))","v":""},{"$f":"IF(B126=\"\",\"\",100-INDEX(Aggs,MATCH(TRUE,(AgMID=$A126),0),19))","v":""},null,null,null,"","","","","+ #4","","",null,null,null,null,"","","","","",null,"","","",""]
[null,{"$f":"IF($A127=\"\",\"\",INDEX(Aggs,MATCH(TRUE,(AgMID=$A127),0),3))","v":""},{"$f":"IF($A127=\"\",\"\",INDEX(Aggs,MATCH(TRUE,(AgMID=$A127),0),8)&\" \"&INDEX(Aggs,MATCH(TRUE,(AgMID=$A127),0),9))","v":""},{"$f":"IF(B127=\"\",\"\",100-INDEX(Aggs,MATCH(TRUE,(AgMID=$A127),0),18))","v":""},{"$f":"IF(B127=\"\",\"\",100-INDEX(Aggs,MATCH(TRUE,(AgMID=$A127),0),19))","v":""},null,null,null,"","","","","+ #4","","",null,null,null,null,"","","","","",null,"","","",""]
[null,{"$f":"IF($A128=\"\",\"\",INDEX(Aggs,MATCH(TRUE,(AgMID=$A128),0),3))","v":""},{"$f":"IF($A128=\"\",\"\",INDEX(Aggs,MATCH(TRUE,(AgMID=$A128),0),8)&\" \"&INDEX(Aggs,MATCH(TRUE,(AgMID=$A128),0),9))","v":""},{"$f":"IF(B128=\"\",\"\",100-INDEX(Aggs,MATCH(TRUE,(AgMID=$A128),0),18))","v":""},{"$f":"IF(B128=\"\",\"\",100-INDEX(Aggs,MATCH(TRUE,(AgMID=$A128),0),19))","v":""},null,null,null,"","","","","+ #4","","",null,null,null,null,"","","","","",null,"","","",""]
[null,{"$f":"IF($A129=\"\",\"\",INDEX(Aggs,MATCH(TRUE,(AgMID=$A129),0),3))","v":""},{"$f":"IF($A129=\"\",\"\",INDEX(Aggs,MATCH(TRUE,(AgMID=$A129),0),8)&\" \"&INDEX(Aggs,MATCH(TRUE,(AgMID=$A129),0),9))","v":""},{"$f":"IF(B129=\"\",\"\",100-INDEX(Aggs,MATCH(TRUE,(AgMID=$A129),0),18))","v":""},{"$f":"IF(B129=\"\",\"\",100-INDEX(Aggs,MATCH(TRUE,(AgMID=$A129),0),19))","v":""},null,null,null,"","","","","+ #4","","",null,null,null,null,"","","","","",null,"","","",""]
[null,{"$f":"IF($A130=\"\",\"\",INDEX(Aggs,MATCH(TRUE,(AgMID=$A130),0),3))","v":""},{"$f":"IF($A130=\"\",\"\",INDEX(Aggs,MATCH(TRUE,(AgMID=$A130),0),8)&\" \"&INDEX(Aggs,MATCH(TRUE,(AgMID=$A130),0),9))","v":""},{"$f":"IF(B130=\"\",\"\",100-INDEX(Aggs,MATCH(TRUE,(AgMID=$A130),0),18))","v":""},{"$f":"IF(B130=\"\",\"\",100-INDEX(Aggs,MATCH(TRUE,(AgMID=$A130),0),19))","v":""},null,null,null,"","","","","+ #4","","",null,null,null,null,"","","","","",null,"","","",""]
[null,{"$f":"IF($A131=\"\",\"\",INDEX(Aggs,MATCH(TRUE,(AgMID=$A131),0),3))","v":""},{"$f":"IF($A131=\"\",\"\",INDEX(Aggs,MATCH(TRUE,(AgMID=$A131),0),8)&\" \"&INDEX(Aggs,MATCH(TRUE,(AgMID=$A131),0),9))","v":""},{"$f":"IF(B131=\"\",\"\",100-INDEX(Aggs,MATCH(TRUE,(AgMID=$A131),0),18))","v":""},{"$f":"IF(B131=\"\",\"\",100-INDEX(Aggs,MATCH(TRUE,(AgMID=$A131),0),19))","v":""},null,null,null,"","","","","+ #4","","",null,null,null,null,"","","","","",null,"","","",""]
[null,{"$f":"IF($A132=\"\",\"\",INDEX(Aggs,MATCH(TRUE,(AgMID=$A132),0),3))","v":""},{"$f":"IF($A132=\"\",\"\",INDEX(Aggs,MATCH(TRUE,(AgMID=$A132),0),8)&\" \"&INDEX(Aggs,MATCH(TRUE,(AgMID=$A132),0),9))","v":""},{"$f":"IF(B132=\"\",\"\",100-INDEX(Aggs,MATCH(TRUE,(AgMID=$A132),0),18))","v":""},{"$f":"IF(B132=\"\",\"\",100-INDEX(Aggs,MATCH(TRUE,(AgMID=$A132),0),19))","v":""},null,null,null,"","","","","+ #4","","",null,null,null,null,"","","","","",null,"","","",""]
[null,{"$f":"IF($A133=\"\",\"\",INDEX(Aggs,MATCH(TRUE,(AgMID=$A133),0),3))","v":""},{"$f":"IF($A133=\"\",\"\",INDEX(Aggs,MATCH(TRUE,(AgMID=$A133),0),8)&\" \"&INDEX(Aggs,MATCH(TRUE,(AgMID=$A133),0),9))","v":""},{"$f":"IF(B133=\"\",\"\",100-INDEX(Aggs,MATCH(TRUE,(AgMID=$A133),0),18))","v":""},{"$f":"IF(B133=\"\",\"\",100-INDEX(Aggs,MATCH(TRUE,(AgMID=$A133),0),19))","v":""},null,null,null,"","","","","+ #4","","",null,null,null,null,"","","","","",null,"","","",""]
[null,{"$f":"IF($A134=\"\",\"\",INDEX(Aggs,MATCH(TRUE,(AgMID=$A134),0),3))","v":""},{"$f":"IF($A134=\"\",\"\",INDEX(Aggs,MATCH(TRUE,(AgMID=$A134),0),8)&\" \"&INDEX(Aggs,MATCH(TRUE,(AgMID=$A134),0),9))","v":""},{"$f":"IF(B134=\"\",\"\",100-INDEX(Aggs,MATCH(TRUE,(AgMID=$A134),0),18))","v":""},{"$f":"IF(B134=\"\",\"\",100-INDEX(Aggs,MATCH(TRUE,(AgMID=$A134),0),19))","v":""},null,null,null,"","","","","+ #4","","",null,null,null,null,"","","","","",null,"","","",""]
[null,{"$f":"IF($A135=\"\",\"\",INDEX(Aggs,MATCH(TRUE,(AgMID=$A135),0),3))","v":""},{"$f":"IF($A135=\"\",\"\",INDEX(Aggs,MATCH(TRUE,(AgMID=$A135),0),8)&\" \"&INDEX(Aggs,MATCH(TRUE,(AgMID=$A135),0),9))","v":""},{"$f":"IF(B135=\"\",\"\",100-INDEX(Aggs,MATCH(TRUE,(AgMID=$A135),0),18))","v":""},{"$f":"IF(B135=\"\",\"\",100-INDEX(Aggs,MATCH(TRUE,(AgMID=$A135),0),19))","v":""},null,null,null,"","","","","+ #4","","",null,null,null,null,"","","","","",null,"","","",""]
[null,{"$f":"IF($A136=\"\",\"\",INDEX(Aggs,MATCH(TRUE,(AgMID=$A136),0),3))","v":""},{"$f":"IF($A136=\"\",\"\",INDEX(Aggs,MATCH(TRUE,(AgMID=$A136),0),8)&\" \"&INDEX(Aggs,MATCH(TRUE,(AgMID=$A136),0),9))","v":""},{"$f":"IF(B136=\"\",\"\",100-INDEX(Aggs,MATCH(TRUE,(AgMID=$A136),0),18))","v":""},{"$f":"IF(B136=\"\",\"\",100-INDEX(Aggs,MATCH(TRUE,(AgMID=$A136),0),19))","v":""},null,null,null,"","","","","+ #4","","",null,null,null,null,"","","","","",null,"","","",""]
[null,{"$f":"IF($A137=\"\",\"\",INDEX(Aggs,MATCH(TRUE,(AgMID=$A137),0),3))","v":""},{"$f":"IF($A137=\"\",\"\",INDEX(Aggs,MATCH(TRUE,(AgMID=$A137),0),8)&\" \"&INDEX(Aggs,MATCH(TRUE,(AgMID=$A137),0),9))","v":""},{"$f":"IF(B137=\"\",\"\",100-INDEX(Aggs,MATCH(TRUE,(AgMID=$A137),0),18))","v":""},{"$f":"IF(B137=\"\",\"\",100-INDEX(Aggs,MATCH(TRUE,(AgMID=$A137),0),19))","v":""},null,null,null,"","","","","+ #4","","",null,null,null,null,"","","","","",null,"","","",""]
[null,{"$f":"IF($A138=\"\",\"\",INDEX(Aggs,MATCH(TRUE,(AgMID=$A138),0),3))","v":""},{"$f":"IF($A138=\"\",\"\",INDEX(Aggs,MATCH(TRUE,(AgMID=$A138),0),8)&\" \"&INDEX(Aggs,MATCH(TRUE,(AgMID=$A138),0),9))","v":""},{"$f":"IF(B138=\"\",\"\",100-INDEX(Aggs,MATCH(TRUE,(AgMID=$A138),0),18))","v":""},{"$f":"IF(B138=\"\",\"\",100-INDEX(Aggs,MATCH(TRUE,(AgMID=$A138),0),19))","v":""},null,null,null,"","","","","+ #4","","",null,null,null,null,"","","","","",null,"","","",""]
[null,{"$f":"IF($A139=\"\",\"\",INDEX(Aggs,MATCH(TRUE,(AgMID=$A139),0),3))","v":""},{"$f":"IF($A139=\"\",\"\",INDEX(Aggs,MATCH(TRUE,(AgMID=$A139),0),8)&\" \"&INDEX(Aggs,MATCH(TRUE,(AgMID=$A139),0),9))","v":""},{"$f":"IF(B139=\"\",\"\",100-INDEX(Aggs,MATCH(TRUE,(AgMID=$A139),0),18))","v":""},{"$f":"IF(B139=\"\",\"\",100-INDEX(Aggs,MATCH(TRUE,(AgMID=$A139),0),19))","v":""},null,null,null,"","","","","+ #4","","",null,null,null,null,"","","","","",null,"","","",""]
[null,{"$f":"IF($A140=\"\",\"\",INDEX(Aggs,MATCH(TRUE,(AgMID=$A140),0),3))","v":""},{"$f":"IF($A140=\"\",\"\",INDEX(Aggs,MATCH(TRUE,(AgMID=$A140),0),8)&\" \"&INDEX(Aggs,MATCH(TRUE,(AgMID=$A140),0),9))","v":""},{"$f":"IF(B140=\"\",\"\",100-INDEX(Aggs,MATCH(TRUE,(AgMID=$A140),0),18))","v":""},{"$f":"IF(B140=\"\",\"\",100-INDEX(Aggs,MATCH(TRUE,(AgMID=$A140),0),19))","v":""},null,null,null,"","","","","+ #4","","",null,null,null,null,"","","","","",null,"","","",""]
[null,{"$f":"IF($A141=\"\",\"\",INDEX(Aggs,MATCH(TRUE,(AgMID=$A141),0),3))","v":""},{"$f":"IF($A141=\"\",\"\",INDEX(Aggs,MATCH(TRUE,(AgMID=$A141),0),8)&\" \"&INDEX(Aggs,MATCH(TRUE,(AgMID=$A141),0),9))","v":""},{"$f":"IF(B141=\"\",\"\",100-INDEX(Aggs,MATCH(TRUE,(AgMID=$A141),0),18))","v":""},{"$f":"IF(B141=\"\",\"\",100-INDEX(Aggs,MATCH(TRUE,(AgMID=$A141),0),19))","v":""},null,null,null,"","","","","+ #4","","",null,null,null,null,"","","","","",null,"","","",""]
[null,{"$f":"IF($A142=\"\",\"\",INDEX(Aggs,MATCH(TRUE,(AgMID=$A142),0),3))","v":""},{"$f":"IF($A142=\"\",\"\",INDEX(Aggs,MATCH(TRUE,(AgMID=$A142),0),8)&\" \"&INDEX(Aggs,MATCH(TRUE,(AgMID=$A142),0),9))","v":""},{"$f":"IF(B142=\"\",\"\",100-INDEX(Aggs,MATCH(TRUE,(AgMID=$A142),0),18))","v":""},{"$f":"IF(B142=\"\",\"\",100-INDEX(Aggs,MATCH(TRUE,(AgMID=$A142),0),19))","v":""},null,null,null,"","","","","+ #4","","",null,null,null,null,"","","","","",null,"","","",""]
[null,{"$f":"IF($A143=\"\",\"\",INDEX(Aggs,MATCH(TRUE,(AgMID=$A143),0),3))","v":""},{"$f":"IF($A143=\"\",\"\",INDEX(Aggs,MATCH(TRUE,(AgMID=$A143),0),8)&\" \"&INDEX(Aggs,MATCH(TRUE,(AgMID=$A143),0),9))","v":""},{"$f":"IF(B143=\"\",\"\",100-INDEX(Aggs,MATCH(TRUE,(AgMID=$A143),0),18))","v":""},{"$f":"IF(B143=\"\",\"\",100-INDEX(Aggs,MATCH(TRUE,(AgMID=$A143),0),19))","v":""},null,null,null,"","","","","+ #4","","",null,null,null,null,"","","","","",null,"","","",""]
[null,{"$f":"IF($A144=\"\",\"\",INDEX(Aggs,MATCH(TRUE,(AgMID=$A144),0),3))","v":""},{"$f":"IF($A144=\"\",\"\",INDEX(Aggs,MATCH(TRUE,(AgMID=$A144),0),8)&\" \"&INDEX(Aggs,MATCH(TRUE,(AgMID=$A144),0),9))","v":""},{"$f":"IF(B144=\"\",\"\",100-INDEX(Aggs,MATCH(TRUE,(AgMID=$A144),0),18))","v":""},{"$f":"IF(B144=\"\",\"\",100-INDEX(Aggs,MATCH(TRUE,(AgMID=$A144),0),19))","v":""},null,null,null,"","","","","+ #4","","",null,null,null,null,"","","","","",null,"","","",""]
[null,{"$f":"IF($A145=\"\",\"\",INDEX(Aggs,MATCH(TRUE,(AgMID=$A145),0),3))","v":""},{"$f":"IF($A145=\"\",\"\",INDEX(Aggs,MATCH(TRUE,(AgMID=$A145),0),8)&\" \"&INDEX(Aggs,MATCH(TRUE,(AgMID=$A145),0),9))","v":""},{"$f":"IF(B145=\"\",\"\",100-INDEX(Aggs,MATCH(TRUE,(AgMID=$A145),0),18))","v":""},{"$f":"IF(B145=\"\",\"\",100-INDEX(Aggs,MATCH(TRUE,(AgMID=$A145),0),19))","v":""},null,null,null,"","","","","+ #4","","",null,null,null,null,"","","","","",null,"","","",""]
[null,{"$f":"IF($A146=\"\",\"\",INDEX(Aggs,MATCH(TRUE,(AgMID=$A146),0),3))","v":""},{"$f":"IF($A146=\"\",\"\",INDEX(Aggs,MATCH(TRUE,(AgMID=$A146),0),8)&\" \"&INDEX(Aggs,MATCH(TRUE,(AgMID=$A146),0),9))","v":""},{"$f":"IF(B146=\"\",\"\",100-INDEX(Aggs,MATCH(TRUE,(AgMID=$A146),0),18))","v":""},{"$f":"IF(B146=\"\",\"\",100-INDEX(Aggs,MATCH(TRUE,(AgMID=$A146),0),19))","v":""},null,null,null,"","","","","+ #4","","",null,null,null,null,"","","","","",null,"","","",""]
[null,{"$f":"IF($A147=\"\",\"\",INDEX(Aggs,MATCH(TRUE,(AgMID=$A147),0),3))","v":""},{"$f":"IF($A147=\"\",\"\",INDEX(Aggs,MATCH(TRUE,(AgMID=$A147),0),8)&\" \"&INDEX(Aggs,MATCH(TRUE,(AgMID=$A147),0),9))","v":""},{"$f":"IF(B147=\"\",\"\",100-INDEX(Aggs,MATCH(TRUE,(AgMID=$A147),0),18))","v":""},{"$f":"IF(B147=\"\",\"\",100-INDEX(Aggs,MATCH(TRUE,(AgMID=$A147),0),19))","v":""},null,null,null,"","","","","+ #4","","",null,null,null,null,"","","","","",null,"","","",""]
[null,{"$f":"IF($A148=\"\",\"\",INDEX(Aggs,MATCH(TRUE,(AgMID=$A148),0),3))","v":""},{"$f":"IF($A148=\"\",\"\",INDEX(Aggs,MATCH(TRUE,(AgMID=$A148),0),8)&\" \"&INDEX(Aggs,MATCH(TRUE,(AgMID=$A148),0),9))","v":""},{"$f":"IF(B148=\"\",\"\",100-INDEX(Aggs,MATCH(TRUE,(AgMID=$A148),0),18))","v":""},{"$f":"IF(B148=\"\",\"\",100-INDEX(Aggs,MATCH(TRUE,(AgMID=$A148),0),19))","v":""},null,null,null,"","","","","+ #4","","",null,null,null,null,"","","","","",null,"","","",""]
[null,{"$f":"IF($A149=\"\",\"\",INDEX(Aggs,MATCH(TRUE,(AgMID=$A149),0),3))","v":""},{"$f":"IF($A149=\"\",\"\",INDEX(Aggs,MATCH(TRUE,(AgMID=$A149),0),8)&\" \"&INDEX(Aggs,MATCH(TRUE,(AgMID=$A149),0),9))","v":""},{"$f":"IF(B149=\"\",\"\",100-INDEX(Aggs,MATCH(TRUE,(AgMID=$A149),0),18))","v":""},{"$f":"IF(B149=\"\",\"\",100-INDEX(Aggs,MATCH(TRUE,(AgMID=$A149),0),19))","v":""},null,null,null,"","","","","+ #4","","",null,null,null,null,"","","","","",null,"","","",""]
[null,{"$f":"IF($A150=\"\",\"\",INDEX(Aggs,MATCH(TRUE,(AgMID=$A150),0),3))","v":""},{"$f":"IF($A150=\"\",\"\",INDEX(Aggs,MATCH(TRUE,(AgMID=$A150),0),8)&\" \"&INDEX(Aggs,MATCH(TRUE,(AgMID=$A150),0),9))","v":""},{"$f":"IF(B150=\"\",\"\",100-INDEX(Aggs,MATCH(TRUE,(AgMID=$A150),0),18))","v":""},{"$f":"IF(B150=\"\",\"\",100-INDEX(Aggs,MATCH(TRUE,(AgMID=$A150),0),19))","v":""},null,null,null,"","","","","+ #4","","",null,null,null,null,"","","","","",null,"","","",""]

{"sheet":"Agg_PI","index":11,"n_rows":15,"n_cols":23,"rows_kept":15,"cut":false,"hidden":false,"merged":[[0,4,0,9]]}
[null,null,null,null,"PLASTICITY INDEX AASHTO T 89 & T 90"]
[]
[null,null,null,null,"Blows","Correction","Can Mass","Wet Mass","Dry Mass","Dry Mass","Moisture","Liquid Limit",null,"Does Not","Can Mass","Wet Mass","Dry Mass","Dry Mass","Moisture",null,null,22,1.0169999999999999]
[null,null,null,null,null,null,null,"+ Can","+ Can",null,null,"Blow Corr.",null,"Roll",null,"+ Can","+ Can",null,null,"PI",null,23,1.0109999999999999]
["Material ID ↓","Source","Grading",null,null,null,"(g)","(g)","(g)","(g)","(%)",null,null,null,"(g)","(g)","(g)","(g)","(%)",null,null,24,1.0049999999999999]
[null,{"$f":"IF($A6=\"\",\"\",INDEX(Aggs,MATCH(TRUE,(AgMID=$A6),0),3))","v":""},{"$f":"IF($A6=\"\",\"\",INDEX(Aggs,MATCH(TRUE,(AgMID=$A6),0),9))","v":""},"LL",null,{"$f":"IF(E6=\"\",\"\",VLOOKUP(E6,$V$3:$W$9,2,FALSE))","v":""},null,null,null,{"$f":"IF(G6=\"\",\"\",I6-G6)","v":""},{"$f":"IF(J6=\"\",\"\",ROUND((H6-I6)/J6*100,1))","v":""},{"$f":"IF(K6=\"\",\"\",ROUND(K6*F6,0))","v":""},"PL",false,null,null,null,{"$f":"IF(O6=\"\",\"\",Q6-O6)","v":""},{"$f":"IF(R6=\"\",\"\",ROUND((P6-Q6)/R6*100,1))","v":""},{"$f":"IF(N6=TRUE,\"Non-Plastic\",IF(OR(L6=\"\",S6=\"\"),\"\",(ROUND(L6-S6,0))))","v":""},null,25,1]
[null,{"$f":"IF($A7=\"\",\"\",INDEX(Aggs,MATCH(TRUE,(AgMID=$A7),0),3))","v":""},{"$f":"IF($A7=\"\",\"\",INDEX(Aggs,MATCH(TRUE,(AgMID=$A7),0),9))","v":""},"LL",null,"",null,null,null,{"$f":"IF(G7=\"\",\"\",I7-G7)","v":""},{"$f":"IF(J7=\"\",\"\",ROUND((H7-I7)/J7*100,1))","v":""},"","PL",false,null,null,null,{"$f":"IF(O7=\"\",\"\",Q7-O7)","v":""},{"$f":"IF(R7=\"\",\"\",ROUND((P7-Q7)/R7*100,1))","v":""},{"$f":"IF(N7=TRUE,\"Non-Plastic\",IF(OR(L7=\"\",S7=\"\"),\"\",(ROUND(L7-S7,0))))","v":""},null,26,0.995]
[null,{"$f":"IF($A8=\"\",\"\",INDEX(Aggs,MATCH(TRUE,(AgMID=$A8),0),3))","v":""},{"$f":"IF($A8=\"\",\"\",INDEX(Aggs,MATCH(TRUE,(AgMID=$A8),0),9))","v":""},"LL",null,"",null,null,null,"","","","PL",false,null,null,null,"","","",null,27,0.99]
[null,{"$f":"IF($A9=\"\",\"\",INDEX(Aggs,MATCH(TRUE,(AgMID=$A9),0),3))","v":""},{"$f":"IF($A9=\"\",\"\",INDEX(Aggs,MATCH(TRUE,(AgMID=$A9),0),9))","v":""},"LL",null,"",null,null,null,"","","","PL",false,null,null,null,"","","",null,28,0.98499999999999999]
[null,{"$f":"IF($A10=\"\",\"\",INDEX(Aggs,MATCH(TRUE,(AgMID=$A10),0),3))","v":""},{"$f":"IF($A10=\"\",\"\",INDEX(Aggs,MATCH(TRUE,(AgMID=$A10),0),9))","v":""},"LL",null,"",null,null,null,"","","","PL",false,null,null,null,"","",""]
[null,{"$f":"IF($A11=\"\",\"\",INDEX(Aggs,MATCH(TRUE,(AgMID=$A11),0),3))","v":""},{"$f":"IF($A11=\"\",\"\",INDEX(Aggs,MATCH(TRUE,(AgMID=$A11),0),9))","v":""},"LL",null,"",null,null,null,"","","","PL",false,null,null,null,"","",""]
[null,{"$f":"IF($A12=\"\",\"\",INDEX(Aggs,MATCH(TRUE,(AgMID=$A12),0),3))","v":""},{"$f":"IF($A12=\"\",\"\",INDEX(Aggs,MATCH(TRUE,(AgMID=$A12),0),9))","v":""},"LL",null,"",null,null,null,"","","","PL",false,null,null,null,"","",""]
[null,{"$f":"IF($A13=\"\",\"\",INDEX(Aggs,MATCH(TRUE,(AgMID=$A13),0),3))","v":""},{"$f":"IF($A13=\"\",\"\",INDEX(Aggs,MATCH(TRUE,(AgMID=$A13),0),9))","v":""},"LL",null,"",null,null,null,"","","","PL",false,null,null,null,"","",""]
[null,{"$f":"IF($A14=\"\",\"\",INDEX(Aggs,MATCH(TRUE,(AgMID=$A14),0),3))","v":""},{"$f":"IF($A14=\"\",\"\",INDEX(Aggs,MATCH(TRUE,(AgMID=$A14),0),9))","v":""},"LL",null,"",null,null,null,"","","","PL",false,null,null,null,"","",""]
[null,{"$f":"IF($A15=\"\",\"\",INDEX(Aggs,MATCH(TRUE,(AgMID=$A15),0),3))","v":""},{"$f":"IF($A15=\"\",\"\",INDEX(Aggs,MATCH(TRUE,(AgMID=$A15),0),9))","v":""},"LL",null,"",null,null,null,"","","","PL",false,null,null,null,"","",""]

{"sheet":"CoreLokAggSpG","index":12,"n_rows":20,"n_cols":15,"rows_kept":20,"cut":false,"hidden":false,"merged":[]}
[null,null,null,null,null,null,null,"Missouri CoreLok Aggregate Specific Gravity Calculation"]
[null,null,null,null,null,null,null,"Calibration Values as of June 2006"]
[]
[]
["Updated 04/23/2007",null,"Enter Rubber Sheet Density",null,null,{"$f":"CoreLok_SpG!F5","v":1.3420000000000001},null,null,null,null,"* Use AASHTO T 84 when no coarse fraction is available; "]
[null,null,"Enter Plastic Bag Density",null,null,{"$f":"CoreLok_SpG!F6","v":0.93200000000000005},"0.903 InstroTek yellow bag",null,null,null,"  blank will produce an approximate value."]
[null,null,null,null,null,null,"0.932 InstroTek green bag"]
["Sample ID","Dry Sample 1 Weight","Sample 1 weight in container filled with water  ","Volumeter Calib.","Bag weight","Rubber sheet weight","Dry Sample 2 weight","Weight of sealed Sample 2 opened in water","P1","Input initial absorption estimate AASHTO    T 85*","Preliminary Absorption","Apparent Specific Gravity","CoreLok Apparent","CoreLok Bulk","Corelok Absorption"]
[null,"A","B","C","D","E","F","G","CorGsb","ABS","CorABS","CorGsa","Gsapred","Gsbpred","ABSpred"]
[null,"(g)","(g)","(g)","(g)","(g)","(g)","(g)","(g/cm3)",null,null,"(g/cm3)"]
[{"$f":"IF(Initial_Info1!B28=\"\",\"\",Initial_Info1!B28)","v":""},{"$f":"IF($A11=\"\",\"\",IF(OR(ISNA(INDEX(AggCoreLok,MATCH(TRUE,(AggCoreLokID=$A11),0),2)),ISBLANK(INDEX(AggCoreLok,MATCH(TRUE,(AggCoreLokID=$A11),0),2))),\"\",INDEX(AggCoreLok,MATCH(TRUE,(AggCoreLokID=$A11),0),2)))","v":""},{"$f":"IF($A11=\"\",\"\",IF(OR(ISNA(INDEX(AggCoreLok,MATCH(TRUE,(AggCoreLokID=$A11),0),3)),ISBLANK(INDEX(AggCoreLok,MATCH(TRUE,(AggCoreLokID=$A11),0),3))),\"\",INDEX(AggCoreLok,MATCH(TRUE,(AggCoreLokID=$A11),0),3)))","v":""},{"$f":"IF($A11=\"\",\"\",IF(OR(ISNA(INDEX(AggCoreLok,MATCH(TRUE,(AggCoreLokID=$A11),0),4)),ISBLANK(INDEX(AggCoreLok,MATCH(TRUE,(AggCoreLokID=$A11),0),4))),\"\",INDEX(AggCoreLok,MATCH(TRUE,(AggCoreLokID=$A11),0),4)))","v":""},{"$f":"IF($A11=\"\",\"\",IF(OR(ISNA(INDEX(AggCoreLok,MATCH(TRUE,(AggCoreLokID=$A11),0),5)),ISBLANK(INDEX(AggCoreLok,MATCH(TRUE,(AggCoreLokID=$A11),0),5))),\"\",INDEX(AggCoreLok,MATCH(TRUE,(AggCoreLokID=$A11),0),5)))","v":""},{"$f":"IF($A11=\"\",\"\",IF(OR(ISNA(INDEX(AggCoreLok,MATCH(TRUE,(AggCoreLokID=$A11),0),6)),ISBLANK(INDEX(AggCoreLok,MATCH(TRUE,(AggCoreLokID=$A11),0),6))),\"\",INDEX(AggCoreLok,MATCH(TRUE,(AggCoreLokID=$A11),0),6)))","v":""},{"$f":"IF($A11=\"\",\"\",IF(OR(ISNA(INDEX(AggCoreLok,MATCH(TRUE,(AggCoreLokID=$A11),0),7)),ISBLANK(INDEX(AggCoreLok,MATCH(TRUE,(AggCoreLokID=$A11),0),7))),\"\",INDEX(AggCoreLok,MATCH(TRUE,(AggCoreLokID=$A11),0),7)))","v":""},{"$f":"IF($A11=\"\",\"\",IF(OR(ISNA(INDEX(AggCoreLok,MATCH(TRUE,(AggCoreLokID=$A11),0),8)),ISBLANK(INDEX(AggCoreLok,MATCH(TRUE,(AggCoreLokID=$A11),0),8))),\"\",INDEX(AggCoreLok,MATCH(TRUE,(AggCoreLokID=$A11),0),8)))","v":""},{"$f":"IF(ISERR(+B11/(D11-(C11-B11))),\"\",B11/(D11-(C11-B11)))","v":""},{"$f":"IF($A11=\"\",\"\",IF(OR(ISNA(INDEX(AggCoreLok,MATCH(TRUE,(AggCoreLokID=$A11),0),10)),ISBLANK(INDEX(AggCoreLok,MATCH(TRUE,(AggCoreLokID=$A11),0),10))),\"\",INDEX(AggCoreLok,MATCH(TRUE,(AggCoreLokID=$A11),0),10)))","v":""},{"$f":"IF(ISERR(+(((L11-I11)/(L11*I11))*100)),\"\",(((L11-I11)/(L11*I11))*100))","v":""},{"$f":"IF(ISERR(+G11/((E11+F11+G11-H11)-(E11/$F$6)-(F11/$F$5))),\"\",G11/((E11+F11+G11-H11)-(E11/$F$6)-(F11/$F$5)))","v":""},{"$f":"IF(I11=\"\",\"\",ROUND(0.24680896+0.90993947*L11-0.02031058*K11,3))","v":""},{"$f":"IF(I11=\"\",\"\",IF(J11=\"\",ROUND(2.71828182845904^(0.5172953+0.425363978*LN(I11)^2+0.047810382*(1/2.71828182845904^K11)),3),ROUND(0.342355+0.8751137*I11-0.051843*J11,3)))","v":""},{"$f":"IF(I11=\"\",\"\",ROUND((1-N11/M11)/N11*100,1))","v":""}]
[{"$f":"IF(Initial_Info1!B29=\"\",\"\",Initial_Info1!B29)","v":""},{"$f":"IF($A12=\"\",\"\",IF(OR(ISNA(INDEX(AggCoreLok,MATCH(TRUE,(AggCoreLokID=$A12),0),2)),ISBLANK(INDEX(AggCoreLok,MATCH(TRUE,(AggCoreLokID=$A12),0),2))),\"\",INDEX(AggCoreLok,MATCH(TRUE,(AggCoreLokID=$A12),0),2)))","v":""},{"$f":"IF($A12=\"\",\"\",IF(OR(ISNA(INDEX(AggCoreLok,MATCH(TRUE,(AggCoreLokID=$A12),0),3)),ISBLANK(INDEX(AggCoreLok,MATCH(TRUE,(AggCoreLokID=$A12),0),3))),\"\",INDEX(AggCoreLok,MATCH(TRUE,(AggCoreLokID=$A12),0),3)))","v":""},{"$f":"IF($A12=\"\",\"\",IF(OR(ISNA(INDEX(AggCoreLok,MATCH(TRUE,(AggCoreLokID=$A12),0),4)),ISBLANK(INDEX(AggCoreLok,MATCH(TRUE,(AggCoreLokID=$A12),0),4))),\"\",INDEX(AggCoreLok,MATCH(TRUE,(AggCoreLokID=$A12),0),4)))","v":""},{"$f":"IF($A12=\"\",\"\",IF(OR(ISNA(INDEX(AggCoreLok,MATCH(TRUE,(AggCoreLokID=$A12),0),5)),ISBLANK(INDEX(AggCoreLok,MATCH(TRUE,(AggCoreLokID=$A12),0),5))),\"\",INDEX(AggCoreLok,MATCH(TRUE,(AggCoreLokID=$A12),0),5)))","v":""},{"$f":"IF($A12=\"\",\"\",IF(OR(ISNA(INDEX(AggCoreLok,MATCH(TRUE,(AggCoreLokID=$A12),0),6)),ISBLANK(INDEX(AggCoreLok,MATCH(TRUE,(AggCoreLokID=$A12),0),6))),\"\",INDEX(AggCoreLok,MATCH(TRUE,(AggCoreLokID=$A12),0),6)))","v":""},{"$f":"IF($A12=\"\",\"\",IF(OR(ISNA(INDEX(AggCoreLok,MATCH(TRUE,(AggCoreLokID=$A12),0),7)),ISBLANK(INDEX(AggCoreLok,MATCH(TRUE,(AggCoreLokID=$A12),0),7))),\"\",INDEX(AggCoreLok,MATCH(TRUE,(AggCoreLokID=$A12),0),7)))","v":""},{"$f":"IF($A12=\"\",\"\",IF(OR(ISNA(INDEX(AggCoreLok,MATCH(TRUE,(AggCoreLokID=$A12),0),8)),ISBLANK(INDEX(AggCoreLok,MATCH(TRUE,(AggCoreLokID=$A12),0),8))),\"\",INDEX(AggCoreLok,MATCH(TRUE,(AggCoreLokID=$A12),0),8)))","v":""},{"$f":"IF(ISERR(+B12/(D12-(C12-B12))),\"\",B12/(D12-(C12-B12)))","v":""},{"$f":"IF($A12=\"\",\"\",IF(OR(ISNA(INDEX(AggCoreLok,MATCH(TRUE,(AggCoreLokID=$A12),0),10)),ISBLANK(INDEX(AggCoreLok,MATCH(TRUE,(AggCoreLokID=$A12),0),10))),\"\",INDEX(AggCoreLok,MATCH(TRUE,(AggCoreLokID=$A12),0),10)))","v":""},{"$f":"IF(ISERR(+(((L12-I12)/(L12*I12))*100)),\"\",(((L12-I12)/(L12*I12))*100))","v":""},{"$f":"IF(ISERR(+G12/((E12+F12+G12-H12)-(E12/$F$6)-(F12/$F$5))),\"\",G12/((E12+F12+G12-H12)-(E12/$F$6)-(F12/$F$5)))","v":""},{"$f":"IF(I12=\"\",\"\",ROUND(0.24680896+0.90993947*L12-0.02031058*K12,3))","v":""},{"$f":"IF(I12=\"\",\"\",IF(J12=\"\",ROUND(2.71828182845904^(0.5172953+0.425363978*LN(I12)^2+0.047810382*(1/2.71828182845904^K12)),3),ROUND(0.342355+0.8751137*I12-0.051843*J12,3)))","v":""},{"$f":"IF(I12=\"\",\"\",ROUND((1-N12/M12)/N12*100,1))","v":""}]
[{"$f":"IF(Initial_Info1!B30=\"\",\"\",Initial_Info1!B30)","v":""},{"$f":"IF($A13=\"\",\"\",IF(OR(ISNA(INDEX(AggCoreLok,MATCH(TRUE,(AggCoreLokID=$A13),0),2)),ISBLANK(INDEX(AggCoreLok,MATCH(TRUE,(AggCoreLokID=$A13),0),2))),\"\",INDEX(AggCoreLok,MATCH(TRUE,(AggCoreLokID=$A13),0),2)))","v":""},{"$f":"IF($A13=\"\",\"\",IF(OR(ISNA(INDEX(AggCoreLok,MATCH(TRUE,(AggCoreLokID=$A13),0),3)),ISBLANK(INDEX(AggCoreLok,MATCH(TRUE,(AggCoreLokID=$A13),0),3))),\"\",INDEX(AggCoreLok,MATCH(TRUE,(AggCoreLokID=$A13),0),3)))","v":""},{"$f":"IF($A13=\"\",\"\",IF(OR(ISNA(INDEX(AggCoreLok,MATCH(TRUE,(AggCoreLokID=$A13),0),4)),ISBLANK(INDEX(AggCoreLok,MATCH(TRUE,(AggCoreLokID=$A13),0),4))),\"\",INDEX(AggCoreLok,MATCH(TRUE,(AggCoreLokID=$A13),0),4)))","v":""},{"$f":"IF($A13=\"\",\"\",IF(OR(ISNA(INDEX(AggCoreLok,MATCH(TRUE,(AggCoreLokID=$A13),0),5)),ISBLANK(INDEX(AggCoreLok,MATCH(TRUE,(AggCoreLokID=$A13),0),5))),\"\",INDEX(AggCoreLok,MATCH(TRUE,(AggCoreLokID=$A13),0),5)))","v":""},{"$f":"IF($A13=\"\",\"\",IF(OR(ISNA(INDEX(AggCoreLok,MATCH(TRUE,(AggCoreLokID=$A13),0),6)),ISBLANK(INDEX(AggCoreLok,MATCH(TRUE,(AggCoreLokID=$A13),0),6))),\"\",INDEX(AggCoreLok,MATCH(TRUE,(AggCoreLokID=$A13),0),6)))","v":""},{"$f":"IF($A13=\"\",\"\",IF(OR(ISNA(INDEX(AggCoreLok,MATCH(TRUE,(AggCoreLokID=$A13),0),7)),ISBLANK(INDEX(AggCoreLok,MATCH(TRUE,(AggCoreLokID=$A13),0),7))),\"\",INDEX(AggCoreLok,MATCH(TRUE,(AggCoreLokID=$A13),0),7)))","v":""},{"$f":"IF($A13=\"\",\"\",IF(OR(ISNA(INDEX(AggCoreLok,MATCH(TRUE,(AggCoreLokID=$A13),0),8)),ISBLANK(INDEX(AggCoreLok,MATCH(TRUE,(AggCoreLokID=$A13),0),8))),\"\",INDEX(AggCoreLok,MATCH(TRUE,(AggCoreLokID=$A13),0),8)))","v":""},"",{"$f":"IF($A13=\"\",\"\",IF(OR(ISNA(INDEX(AggCoreLok,MATCH(TRUE,(AggCoreLokID=$A13),0),10)),ISBLANK(INDEX(AggCoreLok,MATCH(TRUE,(AggCoreLokID=$A13),0),10))),\"\",INDEX(AggCoreLok,MATCH(TRUE,(AggCoreLokID=$A13),0),10)))","v":""},"","","","",""]
[{"$f":"IF(Initial_Info1!B31=\"\",\"\",Initial_Info1!B31)","v":""},{"$f":"IF($A14=\"\",\"\",IF(OR(ISNA(INDEX(AggCoreLok,MATCH(TRUE,(AggCoreLokID=$A14),0),2)),ISBLANK(INDEX(AggCoreLok,MATCH(TRUE,(AggCoreLokID=$A14),0),2))),\"\",INDEX(AggCoreLok,MATCH(TRUE,(AggCoreLokID=$A14),0),2)))","v":""},{"$f":"IF($A14=\"\",\"\",IF(OR(ISNA(INDEX(AggCoreLok,MATCH(TRUE,(AggCoreLokID=$A14),0),3)),ISBLANK(INDEX(AggCoreLok,MATCH(TRUE,(AggCoreLokID=$A14),0),3))),\"\",INDEX(AggCoreLok,MATCH(TRUE,(AggCoreLokID=$A14),0),3)))","v":""},{"$f":"IF($A14=\"\",\"\",IF(OR(ISNA(INDEX(AggCoreLok,MATCH(TRUE,(AggCoreLokID=$A14),0),4)),ISBLANK(INDEX(AggCoreLok,MATCH(TRUE,(AggCoreLokID=$A14),0),4))),\"\",INDEX(AggCoreLok,MATCH(TRUE,(AggCoreLokID=$A14),0),4)))","v":""},{"$f":"IF($A14=\"\",\"\",IF(OR(ISNA(INDEX(AggCoreLok,MATCH(TRUE,(AggCoreLokID=$A14),0),5)),ISBLANK(INDEX(AggCoreLok,MATCH(TRUE,(AggCoreLokID=$A14),0),5))),\"\",INDEX(AggCoreLok,MATCH(TRUE,(AggCoreLokID=$A14),0),5)))","v":""},{"$f":"IF($A14=\"\",\"\",IF(OR(ISNA(INDEX(AggCoreLok,MATCH(TRUE,(AggCoreLokID=$A14),0),6)),ISBLANK(INDEX(AggCoreLok,MATCH(TRUE,(AggCoreLokID=$A14),0),6))),\"\",INDEX(AggCoreLok,MATCH(TRUE,(AggCoreLokID=$A14),0),6)))","v":""},{"$f":"IF($A14=\"\",\"\",IF(OR(ISNA(INDEX(AggCoreLok,MATCH(TRUE,(AggCoreLokID=$A14),0),7)),ISBLANK(INDEX(AggCoreLok,MATCH(TRUE,(AggCoreLokID=$A14),0),7))),\"\",INDEX(AggCoreLok,MATCH(TRUE,(AggCoreLokID=$A14),0),7)))","v":""},{"$f":"IF($A14=\"\",\"\",IF(OR(ISNA(INDEX(AggCoreLok,MATCH(TRUE,(AggCoreLokID=$A14),0),8)),ISBLANK(INDEX(AggCoreLok,MATCH(TRUE,(AggCoreLokID=$A14),0),8))),\"\",INDEX(AggCoreLok,MATCH(TRUE,(AggCoreLokID=$A14),0),8)))","v":""},"",{"$f":"IF($A14=\"\",\"\",IF(OR(ISNA(INDEX(AggCoreLok,MATCH(TRUE,(AggCoreLokID=$A14),0),10)),ISBLANK(INDEX(AggCoreLok,MATCH(TRUE,(AggCoreLokID=$A14),0),10))),\"\",INDEX(AggCoreLok,MATCH(TRUE,(AggCoreLokID=$A14),0),10)))","v":""},"","","","",""]
[{"$f":"IF(Initial_Info1!B32=\"\",\"\",Initial_Info1!B32)","v":""},{"$f":"IF($A15=\"\",\"\",IF(OR(ISNA(INDEX(AggCoreLok,MATCH(TRUE,(AggCoreLokID=$A15),0),2)),ISBLANK(INDEX(AggCoreLok,MATCH(TRUE,(AggCoreLokID=$A15),0),2))),\"\",INDEX(AggCoreLok,MATCH(TRUE,(AggCoreLokID=$A15),0),2)))","v":""},{"$f":"IF($A15=\"\",\"\",IF(OR(ISNA(INDEX(AggCoreLok,MATCH(TRUE,(AggCoreLokID=$A15),0),3)),ISBLANK(INDEX(AggCoreLok,MATCH(TRUE,(AggCoreLokID=$A15),0),3))),\"\",INDEX(AggCoreLok,MATCH(TRUE,(AggCoreLokID=$A15),0),3)))","v":""},{"$f":"IF($A15=\"\",\"\",IF(OR(ISNA(INDEX(AggCoreLok,MATCH(TRUE,(AggCoreLokID=$A15),0),4)),ISBLANK(INDEX(AggCoreLok,MATCH(TRUE,(AggCoreLokID=$A15),0),4))),\"\",INDEX(AggCoreLok,MATCH(TRUE,(AggCoreLokID=$A15),0),4)))","v":""},{"$f":"IF($A15=\"\",\"\",IF(OR(ISNA(INDEX(AggCoreLok,MATCH(TRUE,(AggCoreLokID=$A15),0),5)),ISBLANK(INDEX(AggCoreLok,MATCH(TRUE,(AggCoreLokID=$A15),0),5))),\"\",INDEX(AggCoreLok,MATCH(TRUE,(AggCoreLokID=$A15),0),5)))","v":""},{"$f":"IF($A15=\"\",\"\",IF(OR(ISNA(INDEX(AggCoreLok,MATCH(TRUE,(AggCoreLokID=$A15),0),6)),ISBLANK(INDEX(AggCoreLok,MATCH(TRUE,(AggCoreLokID=$A15),0),6))),\"\",INDEX(AggCoreLok,MATCH(TRUE,(AggCoreLokID=$A15),0),6)))","v":""},{"$f":"IF($A15=\"\",\"\",IF(OR(ISNA(INDEX(AggCoreLok,MATCH(TRUE,(AggCoreLokID=$A15),0),7)),ISBLANK(INDEX(AggCoreLok,MATCH(TRUE,(AggCoreLokID=$A15),0),7))),\"\",INDEX(AggCoreLok,MATCH(TRUE,(AggCoreLokID=$A15),0),7)))","v":""},{"$f":"IF($A15=\"\",\"\",IF(OR(ISNA(INDEX(AggCoreLok,MATCH(TRUE,(AggCoreLokID=$A15),0),8)),ISBLANK(INDEX(AggCoreLok,MATCH(TRUE,(AggCoreLokID=$A15),0),8))),\"\",INDEX(AggCoreLok,MATCH(TRUE,(AggCoreLokID=$A15),0),8)))","v":""},"",{"$f":"IF($A15=\"\",\"\",IF(OR(ISNA(INDEX(AggCoreLok,MATCH(TRUE,(AggCoreLokID=$A15),0),10)),ISBLANK(INDEX(AggCoreLok,MATCH(TRUE,(AggCoreLokID=$A15),0),10))),\"\",INDEX(AggCoreLok,MATCH(TRUE,(AggCoreLokID=$A15),0),10)))","v":""},"","","","",""]
[{"$f":"IF(Initial_Info1!B35=\"\",\"\",Initial_Info1!B35)","v":""},{"$f":"IF($A16=\"\",\"\",IF(OR(ISNA(INDEX(AggCoreLok,MATCH(TRUE,(AggCoreLokID=$A16),0),2)),ISBLANK(INDEX(AggCoreLok,MATCH(TRUE,(AggCoreLokID=$A16),0),2))),\"\",INDEX(AggCoreLok,MATCH(TRUE,(AggCoreLokID=$A16),0),2)))","v":""},{"$f":"IF($A16=\"\",\"\",IF(OR(ISNA(INDEX(AggCoreLok,MATCH(TRUE,(AggCoreLokID=$A16),0),3)),ISBLANK(INDEX(AggCoreLok,MATCH(TRUE,(AggCoreLokID=$A16),0),3))),\"\",INDEX(AggCoreLok,MATCH(TRUE,(AggCoreLokID=$A16),0),3)))","v":""},{"$f":"IF($A16=\"\",\"\",IF(OR(ISNA(INDEX(AggCoreLok,MATCH(TRUE,(AggCoreLokID=$A16),0),4)),ISBLANK(INDEX(AggCoreLok,MATCH(TRUE,(AggCoreLokID=$A16),0),4))),\"\",INDEX(AggCoreLok,MATCH(TRUE,(AggCoreLokID=$A16),0),4)))","v":""},{"$f":"IF($A16=\"\",\"\",IF(OR(ISNA(INDEX(AggCoreLok,MATCH(TRUE,(AggCoreLokID=$A16),0),5)),ISBLANK(INDEX(AggCoreLok,MATCH(TRUE,(AggCoreLokID=$A16),0),5))),\"\",INDEX(AggCoreLok,MATCH(TRUE,(AggCoreLokID=$A16),0),5)))","v":""},{"$f":"IF($A16=\"\",\"\",IF(OR(ISNA(INDEX(AggCoreLok,MATCH(TRUE,(AggCoreLokID=$A16),0),6)),ISBLANK(INDEX(AggCoreLok,MATCH(TRUE,(AggCoreLokID=$A16),0),6))),\"\",INDEX(AggCoreLok,MATCH(TRUE,(AggCoreLokID=$A16),0),6)))","v":""},{"$f":"IF($A16=\"\",\"\",IF(OR(ISNA(INDEX(AggCoreLok,MATCH(TRUE,(AggCoreLokID=$A16),0),7)),ISBLANK(INDEX(AggCoreLok,MATCH(TRUE,(AggCoreLokID=$A16),0),7))),\"\",INDEX(AggCoreLok,MATCH(TRUE,(AggCoreLokID=$A16),0),7)))","v":""},{"$f":"IF($A16=\"\",\"\",IF(OR(ISNA(INDEX(AggCoreLok,MATCH(TRUE,(AggCoreLokID=$A16),0),8)),ISBLANK(INDEX(AggCoreLok,MATCH(TRUE,(AggCoreLokID=$A16),0),8))),\"\",INDEX(AggCoreLok,MATCH(TRUE,(AggCoreLokID=$A16),0),8)))","v":""},"",{"$f":"IF($A16=\"\",\"\",IF(OR(ISNA(INDEX(AggCoreLok,MATCH(TRUE,(AggCoreLokID=$A16),0),10)),ISBLANK(INDEX(AggCoreLok,MATCH(TRUE,(AggCoreLokID=$A16),0),10))),\"\",INDEX(AggCoreLok,MATCH(TRUE,(AggCoreLokID=$A16),0),10)))","v":""},"","","","",""]
[{"$f":"IF(Initial_Info1!B36=\"\",\"\",Initial_Info1!B36)","v":""},{"$f":"IF($A17=\"\",\"\",IF(OR(ISNA(INDEX(AggCoreLok,MATCH(TRUE,(AggCoreLokID=$A17),0),2)),ISBLANK(INDEX(AggCoreLok,MATCH(TRUE,(AggCoreLokID=$A17),0),2))),\"\",INDEX(AggCoreLok,MATCH(TRUE,(AggCoreLokID=$A17),0),2)))","v":""},{"$f":"IF($A17=\"\",\"\",IF(OR(ISNA(INDEX(AggCoreLok,MATCH(TRUE,(AggCoreLokID=$A17),0),3)),ISBLANK(INDEX(AggCoreLok,MATCH(TRUE,(AggCoreLokID=$A17),0),3))),\"\",INDEX(AggCoreLok,MATCH(TRUE,(AggCoreLokID=$A17),0),3)))","v":""},{"$f":"IF($A17=\"\",\"\",IF(OR(ISNA(INDEX(AggCoreLok,MATCH(TRUE,(AggCoreLokID=$A17),0),4)),ISBLANK(INDEX(AggCoreLok,MATCH(TRUE,(AggCoreLokID=$A17),0),4))),\"\",INDEX(AggCoreLok,MATCH(TRUE,(AggCoreLokID=$A17),0),4)))","v":""},{"$f":"IF($A17=\"\",\"\",IF(OR(ISNA(INDEX(AggCoreLok,MATCH(TRUE,(AggCoreLokID=$A17),0),5)),ISBLANK(INDEX(AggCoreLok,MATCH(TRUE,(AggCoreLokID=$A17),0),5))),\"\",INDEX(AggCoreLok,MATCH(TRUE,(AggCoreLokID=$A17),0),5)))","v":""},{"$f":"IF($A17=\"\",\"\",IF(OR(ISNA(INDEX(AggCoreLok,MATCH(TRUE,(AggCoreLokID=$A17),0),6)),ISBLANK(INDEX(AggCoreLok,MATCH(TRUE,(AggCoreLokID=$A17),0),6))),\"\",INDEX(AggCoreLok,MATCH(TRUE,(AggCoreLokID=$A17),0),6)))","v":""},{"$f":"IF($A17=\"\",\"\",IF(OR(ISNA(INDEX(AggCoreLok,MATCH(TRUE,(AggCoreLokID=$A17),0),7)),ISBLANK(INDEX(AggCoreLok,MATCH(TRUE,(AggCoreLokID=$A17),0),7))),\"\",INDEX(AggCoreLok,MATCH(TRUE,(AggCoreLokID=$A17),0),7)))","v":""},{"$f":"IF($A17=\"\",\"\",IF(OR(ISNA(INDEX(AggCoreLok,MATCH(TRUE,(AggCoreLokID=$A17),0),8)),ISBLANK(INDEX(AggCoreLok,MATCH(TRUE,(AggCoreLokID=$A17),0),8))),\"\",INDEX(AggCoreLok,MATCH(TRUE,(AggCoreLokID=$A17),0),8)))","v":""},"",{"$f":"IF($A17=\"\",\"\",IF(OR(ISNA(INDEX(AggCoreLok,MATCH(TRUE,(AggCoreLokID=$A17),0),10)),ISBLANK(INDEX(AggCoreLok,MATCH(TRUE,(AggCoreLokID=$A17),0),10))),\"\",INDEX(AggCoreLok,MATCH(TRUE,(AggCoreLokID=$A17),0),10)))","v":""},"","","","",""]
[{"$f":"IF(Initial_Info1!B37=\"\",\"\",Initial_Info1!B37)","v":""},{"$f":"IF($A18=\"\",\"\",IF(OR(ISNA(INDEX(AggCoreLok,MATCH(TRUE,(AggCoreLokID=$A18),0),2)),ISBLANK(INDEX(AggCoreLok,MATCH(TRUE,(AggCoreLokID=$A18),0),2))),\"\",INDEX(AggCoreLok,MATCH(TRUE,(AggCoreLokID=$A18),0),2)))","v":""},{"$f":"IF($A18=\"\",\"\",IF(OR(ISNA(INDEX(AggCoreLok,MATCH(TRUE,(AggCoreLokID=$A18),0),3)),ISBLANK(INDEX(AggCoreLok,MATCH(TRUE,(AggCoreLokID=$A18),0),3))),\"\",INDEX(AggCoreLok,MATCH(TRUE,(AggCoreLokID=$A18),0),3)))","v":""},{"$f":"IF($A18=\"\",\"\",IF(OR(ISNA(INDEX(AggCoreLok,MATCH(TRUE,(AggCoreLokID=$A18),0),4)),ISBLANK(INDEX(AggCoreLok,MATCH(TRUE,(AggCoreLokID=$A18),0),4))),\"\",INDEX(AggCoreLok,MATCH(TRUE,(AggCoreLokID=$A18),0),4)))","v":""},{"$f":"IF($A18=\"\",\"\",IF(OR(ISNA(INDEX(AggCoreLok,MATCH(TRUE,(AggCoreLokID=$A18),0),5)),ISBLANK(INDEX(AggCoreLok,MATCH(TRUE,(AggCoreLokID=$A18),0),5))),\"\",INDEX(AggCoreLok,MATCH(TRUE,(AggCoreLokID=$A18),0),5)))","v":""},{"$f":"IF($A18=\"\",\"\",IF(OR(ISNA(INDEX(AggCoreLok,MATCH(TRUE,(AggCoreLokID=$A18),0),6)),ISBLANK(INDEX(AggCoreLok,MATCH(TRUE,(AggCoreLokID=$A18),0),6))),\"\",INDEX(AggCoreLok,MATCH(TRUE,(AggCoreLokID=$A18),0),6)))","v":""},{"$f":"IF($A18=\"\",\"\",IF(OR(ISNA(INDEX(AggCoreLok,MATCH(TRUE,(AggCoreLokID=$A18),0),7)),ISBLANK(INDEX(AggCoreLok,MATCH(TRUE,(AggCoreLokID=$A18),0),7))),\"\",INDEX(AggCoreLok,MATCH(TRUE,(AggCoreLokID=$A18),0),7)))","v":""},{"$f":"IF($A18=\"\",\"\",IF(OR(ISNA(INDEX(AggCoreLok,MATCH(TRUE,(AggCoreLokID=$A18),0),8)),ISBLANK(INDEX(AggCoreLok,MATCH(TRUE,(AggCoreLokID=$A18),0),8))),\"\",INDEX(AggCoreLok,MATCH(TRUE,(AggCoreLokID=$A18),0),8)))","v":""},"",{"$f":"IF($A18=\"\",\"\",IF(OR(ISNA(INDEX(AggCoreLok,MATCH(TRUE,(AggCoreLokID=$A18),0),10)),ISBLANK(INDEX(AggCoreLok,MATCH(TRUE,(AggCoreLokID=$A18),0),10))),\"\",INDEX(AggCoreLok,MATCH(TRUE,(AggCoreLokID=$A18),0),10)))","v":""},"","","","",""]
[{"$f":"IF(Initial_Info1!B38=\"\",\"\",Initial_Info1!B38)","v":""},{"$f":"IF($A19=\"\",\"\",IF(OR(ISNA(INDEX(AggCoreLok,MATCH(TRUE,(AggCoreLokID=$A19),0),2)),ISBLANK(INDEX(AggCoreLok,MATCH(TRUE,(AggCoreLokID=$A19),0),2))),\"\",INDEX(AggCoreLok,MATCH(TRUE,(AggCoreLokID=$A19),0),2)))","v":""},{"$f":"IF($A19=\"\",\"\",IF(OR(ISNA(INDEX(AggCoreLok,MATCH(TRUE,(AggCoreLokID=$A19),0),3)),ISBLANK(INDEX(AggCoreLok,MATCH(TRUE,(AggCoreLokID=$A19),0),3))),\"\",INDEX(AggCoreLok,MATCH(TRUE,(AggCoreLokID=$A19),0),3)))","v":""},{"$f":"IF($A19=\"\",\"\",IF(OR(ISNA(INDEX(AggCoreLok,MATCH(TRUE,(AggCoreLokID=$A19),0),4)),ISBLANK(INDEX(AggCoreLok,MATCH(TRUE,(AggCoreLokID=$A19),0),4))),\"\",INDEX(AggCoreLok,MATCH(TRUE,(AggCoreLokID=$A19),0),4)))","v":""},{"$f":"IF($A19=\"\",\"\",IF(OR(ISNA(INDEX(AggCoreLok,MATCH(TRUE,(AggCoreLokID=$A19),0),5)),ISBLANK(INDEX(AggCoreLok,MATCH(TRUE,(AggCoreLokID=$A19),0),5))),\"\",INDEX(AggCoreLok,MATCH(TRUE,(AggCoreLokID=$A19),0),5)))","v":""},{"$f":"IF($A19=\"\",\"\",IF(OR(ISNA(INDEX(AggCoreLok,MATCH(TRUE,(AggCoreLokID=$A19),0),6)),ISBLANK(INDEX(AggCoreLok,MATCH(TRUE,(AggCoreLokID=$A19),0),6))),\"\",INDEX(AggCoreLok,MATCH(TRUE,(AggCoreLokID=$A19),0),6)))","v":""},{"$f":"IF($A19=\"\",\"\",IF(OR(ISNA(INDEX(AggCoreLok,MATCH(TRUE,(AggCoreLokID=$A19),0),7)),ISBLANK(INDEX(AggCoreLok,MATCH(TRUE,(AggCoreLokID=$A19),0),7))),\"\",INDEX(AggCoreLok,MATCH(TRUE,(AggCoreLokID=$A19),0),7)))","v":""},{"$f":"IF($A19=\"\",\"\",IF(OR(ISNA(INDEX(AggCoreLok,MATCH(TRUE,(AggCoreLokID=$A19),0),8)),ISBLANK(INDEX(AggCoreLok,MATCH(TRUE,(AggCoreLokID=$A19),0),8))),\"\",INDEX(AggCoreLok,MATCH(TRUE,(AggCoreLokID=$A19),0),8)))","v":""},"",{"$f":"IF($A19=\"\",\"\",IF(OR(ISNA(INDEX(AggCoreLok,MATCH(TRUE,(AggCoreLokID=$A19),0),10)),ISBLANK(INDEX(AggCoreLok,MATCH(TRUE,(AggCoreLokID=$A19),0),10))),\"\",INDEX(AggCoreLok,MATCH(TRUE,(AggCoreLokID=$A19),0),10)))","v":""},"","","","",""]
[{"$f":"IF(Initial_Info1!B39=\"\",\"\",Initial_Info1!B39)","v":""},{"$f":"IF($A20=\"\",\"\",IF(OR(ISNA(INDEX(AggCoreLok,MATCH(TRUE,(AggCoreLokID=$A20),0),2)),ISBLANK(INDEX(AggCoreLok,MATCH(TRUE,(AggCoreLokID=$A20),0),2))),\"\",INDEX(AggCoreLok,MATCH(TRUE,(AggCoreLokID=$A20),0),2)))","v":""},{"$f":"IF($A20=\"\",\"\",IF(OR(ISNA(INDEX(AggCoreLok,MATCH(TRUE,(AggCoreLokID=$A20),0),3)),ISBLANK(INDEX(AggCoreLok,MATCH(TRUE,(AggCoreLokID=$A20),0),3))),\"\",INDEX(AggCoreLok,MATCH(TRUE,(AggCoreLokID=$A20),0),3)))","v":""},{"$f":"IF($A20=\"\",\"\",IF(OR(ISNA(INDEX(AggCoreLok,MATCH(TRUE,(AggCoreLokID=$A20),0),4)),ISBLANK(INDEX(AggCoreLok,MATCH(TRUE,(AggCoreLokID=$A20),0),4))),\"\",INDEX(AggCoreLok,MATCH(TRUE,(AggCoreLokID=$A20),0),4)))","v":""},{"$f":"IF($A20=\"\",\"\",IF(OR(ISNA(INDEX(AggCoreLok,MATCH(TRUE,(AggCoreLokID=$A20),0),5)),ISBLANK(INDEX(AggCoreLok,MATCH(TRUE,(AggCoreLokID=$A20),0),5))),\"\",INDEX(AggCoreLok,MATCH(TRUE,(AggCoreLokID=$A20),0),5)))","v":""},{"$f":"IF($A20=\"\",\"\",IF(OR(ISNA(INDEX(AggCoreLok,MATCH(TRUE,(AggCoreLokID=$A20),0),6)),ISBLANK(INDEX(AggCoreLok,MATCH(TRUE,(AggCoreLokID=$A20),0),6))),\"\",INDEX(AggCoreLok,MATCH(TRUE,(AggCoreLokID=$A20),0),6)))","v":""},{"$f":"IF($A20=\"\",\"\",IF(OR(ISNA(INDEX(AggCoreLok,MATCH(TRUE,(AggCoreLokID=$A20),0),7)),ISBLANK(INDEX(AggCoreLok,MATCH(TRUE,(AggCoreLokID=$A20),0),7))),\"\",INDEX(AggCoreLok,MATCH(TRUE,(AggCoreLokID=$A20),0),7)))","v":""},{"$f":"IF($A20=\"\",\"\",IF(OR(ISNA(INDEX(AggCoreLok,MATCH(TRUE,(AggCoreLokID=$A20),0),8)),ISBLANK(INDEX(AggCoreLok,MATCH(TRUE,(AggCoreLokID=$A20),0),8))),\"\",INDEX(AggCoreLok,MATCH(TRUE,(AggCoreLokID=$A20),0),8)))","v":""},"",{"$f":"IF($A20=\"\",\"\",IF(OR(ISNA(INDEX(AggCoreLok,MATCH(TRUE,(AggCoreLokID=$A20),0),10)),ISBLANK(INDEX(AggCoreLok,MATCH(TRUE,(AggCoreLokID=$A20),0),10))),\"\",INDEX(AggCoreLok,MATCH(TRUE,(AggCoreLokID=$A20),0),10)))","v":""},"","","","",""]

{"sheet":"CoreLok_SpG","index":13,"n_rows":150,"n_cols":17,"rows_kept":150,"cut":false,"hidden":false,"merged":[]}
[null,null,null,null,null,null,null,"Missouri CoreLok Aggregate Specific Gravity Calculation"]
[null,null,null,null,null,null,null,"Calibration Values as of June 2006"]
[]
[]
["Updated 04/23/2007",null,"Enter Rubber Sheet Density",null,null,1.3420000000000001,null,null,null,null,"* Use AASHTO T 84 when no coarse fraction is available; "]
[null,null,"Enter Plastic Bag Density",null,null,0.93200000000000005,"0.903 InstroTek yellow bag",null,null,null,"  blank will produce an approximate value."]
[null,null,null,null,null,null,"0.932 InstroTek green bag"]
["Material ID ↓","Dry Mass Sample 1","Sample 1 mass in container filled with water  ","Volumeter Calib.","Bag Mass","Rubber Sheet Mass","Dry Mass Sample 2","Mass of sealed Sample 2 opened in water","P1","Input initial absorption estimate AASHTO    T 85*","Preliminary Absorption","Apparent Specific Gravity","CoreLok Apparent","CoreLok Bulk","Corelok Absorption"]
[null,"A","B","C","D","E","F","G","CorGsb","ABS","CorABS","CorGsa","Gsapred","Gsbpred","ABSpred"]
[null,"(g)","(g)","(g)","(g)","(g)","(g)","(g)","(g/cm3)",null,null,"(g/cm3)",null,null,null,null,"Repeat and Check Masses IF:"]
[null,null,null,null,null,null,null,null,{"$f":"IF(ISERR(+B11/(D11-(C11-B11))),\"\",B11/(D11-(C11-B11)))","v":""},2.5,{"$f":"IF(ISERR(+(((L11-I11)/(L11*I11))*100)),\"\",(((L11-I11)/(L11*I11))*100))","v":""},{"$f":"IF(ISERR(+G11/((E11+F11+G11-H11)-(E11/$F$6)-(F11/$F$5))),\"\",G11/((E11+F11+G11-H11)-(E11/$F$6)-(F11/$F$5)))","v":""},{"$f":"IF(I11=\"\",\"\",ROUND(0.24680896+0.90993947*L11-0.02031058*K11,3))","v":""},{"$f":"IF(I11=\"\",\"\",IF(J11=\"\",ROUND(2.71828182845904^(0.5172953+0.425363978*LN(I11)^2+0.047810382*(1/2.71828182845904^K11)),3),ROUND(0.342355+0.8751137*I11-0.051843*J11,3)))","v":""},{"$f":"IF(I11=\"\",\"\",ROUND((1-N11/M11)/N11*100,1))","v":""},null,"\"Preliminary Absorption\" is negative."]
[null,null,null,null,null,null,null,null,"",null,"","",{"$f":"IF(I12=\"\",\"\",ROUND(0.24680896+0.90993947*L12-0.02031058*K12,3))","v":""},{"$f":"IF(I12=\"\",\"\",IF(J12=\"\",ROUND(2.71828182845904^(0.5172953+0.425363978*LN(I12)^2+0.047810382*(1/2.71828182845904^K12)),3),ROUND(0.342355+0.8751137*I12-0.051843*J12,3)))","v":""},{"$f":"IF(I12=\"\",\"\",ROUND((1-N12/M12)/N12*100,1))","v":""},null,"\"CoreLok Absorption\" is not within a few tenths of the initial estimate."]
[null,null,null,null,null,null,null,null,"",null,"","","","",""]
[null,null,null,null,null,null,null,null,"",null,"","","","",""]
[null,null,null,null,null,null,null,null,"",null,"","","","",""]
[null,null,null,null,null,null,null,null,"",null,"","","","",""]
[null,null,null,null,null,null,null,null,"",null,"","","","",""]
[null,null,null,null,null,null,null,null,"",null,"","","","",""]
[null,null,null,null,null,null,null,null,"",null,"","","","",""]
[null,null,null,null,null,null,null,null,"",null,"","","","",""]
[null,null,null,null,null,null,null,null,{"$f":"IF(ISERR(+B21/(D21-(C21-B21))),\"\",B21/(D21-(C21-B21)))","v":""},null,{"$f":"IF(ISERR(+(((L21-I21)/(L21*I21))*100)),\"\",(((L21-I21)/(L21*I21))*100))","v":""},{"$f":"IF(ISERR(+G21/((E21+F21+G21-H21)-(E21/$F$6)-(F21/$F$5))),\"\",G21/((E21+F21+G21-H21)-(E21/$F$6)-(F21/$F$5)))","v":""},{"$f":"IF(I21=\"\",\"\",ROUND(0.24680896+0.90993947*L21-0.02031058*K21,3))","v":""},{"$f":"IF(I21=\"\",\"\",IF(J21=\"\",ROUND(2.71828182845904^(0.5172953+0.425363978*LN(I21)^2+0.047810382*(1/2.71828182845904^K21)),3),ROUND(0.342355+0.8751137*I21-0.051843*J21,3)))","v":""},{"$f":"IF(I21=\"\",\"\",ROUND((1-N21/M21)/N21*100,1))","v":""}]
[null,null,null,null,null,null,null,null,"",null,"","","","",""]
[null,null,null,null,null,null,null,null,"",null,"","","","",""]
[null,null,null,null,null,null,null,null,"",null,"","","","",""]
[null,null,null,null,null,null,null,null,"",null,"","","","",""]
[null,null,null,null,null,null,null,null,"",null,"","","","",""]
[null,null,null,null,null,null,null,null,"",null,"","","","",""]
[null,null,null,null,null,null,null,null,"",null,"","","","",""]
[null,null,null,null,null,null,null,null,"",null,"","","","",""]
[null,null,null,null,null,null,null,null,"",null,"","","","",""]
[null,null,null,null,null,null,null,null,"",null,"","","","",""]
[null,null,null,null,null,null,null,null,"",null,"","","","",""]
[null,null,null,null,null,null,null,null,"",null,"","","","",""]
[null,null,null,null,null,null,null,null,"",null,"","","","",""]
[null,null,null,null,null,null,null,null,"",null,"","","","",""]
[null,null,null,null,null,null,null,null,"",null,"","","","",""]
[null,null,null,null,null,null,null,null,"",null,"","","","",""]
[null,null,null,null,null,null,null,null,"",null,"","","","",""]
[null,null,null,null,null,null,null,null,"",null,"","","","",""]
[null,null,null,null,null,null,null,null,"",null,"","","","",""]
[null,null,null,null,null,null,null,null,"",null,"","","","",""]
[null,null,null,null,null,null,null,null,"",null,"","","","",""]
[null,null,null,null,null,null,null,null,"",null,"","","","",""]
[null,null,null,null,null,null,null,null,"",null,"","","","",""]
[null,null,null,null,null,null,null,null,"",null,"","","","",""]
[null,null,null,null,null,null,null,null,"",null,"","","","",""]
[null,null,null,null,null,null,null,null,"",null,"","","","",""]
[null,null,null,null,null,null,null,null,"",null,"","","","",""]
[null,null,null,null,null,null,null,null,"",null,"","","","",""]
[null,null,null,null,null,null,null,null,"",null,"","","","",""]
[null,null,null,null,null,null,null,null,"",null,"","","","",""]
[null,null,null,null,null,null,null,null,"",null,"","","","",""]
[null,null,null,null,null,null,null,null,"",null,"","","","",""]
[null,null,null,null,null,null,null,null,"",null,"","","","",""]
[null,null,null,null,null,null,null,null,"",null,"","","","",""]
[null,null,null,null,null,null,null,null,"",null,"","","","",""]
[null,null,null,null,null,null,null,null,"",null,"","","","",""]
[null,null,null,null,null,null,null,null,"",null,"","","","",""]
[null,null,null,null,null,null,null,null,"",null,"","","","",""]
[null,null,null,null,null,null,null,null,"",null,"","","","",""]
[null,null,null,null,null,null,null,null,"",null,"","","","",""]
[null,null,null,null,null,null,null,null,"",null,"","","","",""]
[null,null,null,null,null,null,null,null,"",null,"","","","",""]
[null,null,null,null,null,null,null,null,"",null,"","","","",""]
[null,null,null,null,null,null,null,null,"",null,"","","","",""]
[null,null,null,null,null,null,null,null,"",null,"","","","",""]
[null,null,null,null,null,null,null,null,"",null,"","","","",""]
[null,null,null,null,null,null,null,null,"",null,"","","","",""]
[null,null,null,null,null,null,null,null,"",null,"","","","",""]
[null,null,null,null,null,null,null,null,"",null,"","","","",""]
[null,null,null,null,null,null,null,null,"",null,"","","","",""]
[null,null,null,null,null,null,null,null,"",null,"","","","",""]
[null,null,null,null,null,null,null,null,"",null,"","","","",""]
[null,null,null,null,null,null,null,null,"",null,"","","","",""]
[null,null,null,null,null,null,null,null,"",null,"","","","",""]
[null,null,null,null,null,null,null,null,"",null,"","","","",""]
[null,null,null,null,null,null,null,null,"",null,"","","","",""]
[null,null,null,null,null,null,null,null,"",null,"","","","",""]
[null,null,null,null,null,null,null,null,"",null,"","","","",""]
[null,null,null,null,null,null,null,null,"",null,"","","","",""]
[null,null,null,null,null,null,null,null,"",null,"","","","",""]
[null,null,null,null,null,null,null,null,"",null,"","","","",""]
[null,null,null,null,null,null,null,null,"",null,"","","","",""]
[null,null,null,null,null,null,null,null,"",null,"","","","",""]
[null,null,null,null,null,null,null,null,{"$f":"IF(ISERR(+B85/(D85-(C85-B85))),\"\",B85/(D85-(C85-B85)))","v":""},null,{"$f":"IF(ISERR(+(((L85-I85)/(L85*I85))*100)),\"\",(((L85-I85)/(L85*I85))*100))","v":""},{"$f":"IF(ISERR(+G85/((E85+F85+G85-H85)-(E85/$F$6)-(F85/$F$5))),\"\",G85/((E85+F85+G85-H85)-(E85/$F$6)-(F85/$F$5)))","v":""},{"$f":"IF(I85=\"\",\"\",ROUND(0.24680896+0.90993947*L85-0.02031058*K85,3))","v":""},{"$f":"IF(I85=\"\",\"\",IF(J85=\"\",ROUND(2.71828182845904^(0.5172953+0.425363978*LN(I85)^2+0.047810382*(1/2.71828182845904^K85)),3),ROUND(0.342355+0.8751137*I85-0.051843*J85,3)))","v":""},{"$f":"IF(I85=\"\",\"\",ROUND((1-N85/M85)/N85*100,1))","v":""}]
[null,null,null,null,null,null,null,null,"",null,"","","","",""]
[null,null,null,null,null,null,null,null,"",null,"","","","",""]
[null,null,null,null,null,null,null,null,"",null,"","","","",""]
[null,null,null,null,null,null,null,null,"",null,"","","","",""]
[null,null,null,null,null,null,null,null,"",null,"","","","",""]
[null,null,null,null,null,null,null,null,"",null,"","","","",""]
[null,null,null,null,null,null,null,null,"",null,"","","","",""]
[null,null,null,null,null,null,null,null,"",null,"","","","",""]
[null,null,null,null,null,null,null,null,"",null,"","","","",""]
[null,null,null,null,null,null,null,null,"",null,"","","","",""]
[null,null,null,null,null,null,null,null,"",null,"","","","",""]
[null,null,null,null,null,null,null,null,"",null,"","","","",""]
[null,null,null,null,null,null,null,null,"",null,"","","","",""]
[null,null,null,null,null,null,null,null,"",null,"","","","",""]
[null,null,null,null,null,null,null,null,"",null,"","","","",""]
[null,null,null,null,null,null,null,null,"",null,"","","","",""]
[null,null,null,null,null,null,null,null,"",null,"","","","",""]
[null,null,null,null,null,null,null,null,"",null,"","","","",""]
[null,null,null,null,null,null,null,null,"",null,"","","","",""]
[null,null,null,null,null,null,null,null,"",null,"","","","",""]
[null,null,null,null,null,null,null,null,"",null,"","","","",""]
[null,null,null,null,null,null,null,null,"",null,"","","","",""]
[null,null,null,null,null,null,null,null,"",null,"","","","",""]
[null,null,null,null,null,null,null,null,"",null,"","","","",""]
[null,null,null,null,null,null,null,null,"",null,"","","","",""]
[null,null,null,null,null,null,null,null,"",null,"","","","",""]
[null,null,null,null,null,null,null,null,"",null,"","","","",""]
[null,null,null,null,null,null,null,null,"",null,"","","","",""]
[null,null,null,null,null,null,null,null,"",null,"","","","",""]
[null,null,null,null,null,null,null,null,"",null,"","","","",""]
[null,null,null,null,null,null,null,null,"",null,"","","","",""]
[null,null,null,null,null,null,null,null,"",null,"","","","",""]
[null,null,null,null,null,null,null,null,"",null,"","","","",""]
[null,null,null,null,null,null,null,null,"",null,"","","","",""]
[null,null,null,null,null,null,null,null,"",null,"","","","",""]
[null,null,null,null,null,null,null,null,"",null,"","","","",""]
[null,null,null,null,null,null,null,null,"",null,"","","","",""]
[null,null,null,null,null,null,null,null,"",null,"","","","",""]
[null,null,null,null,null,null,null,null,"",null,"","","","",""]
[null,null,null,null,null,null,null,null,"",null,"","","","",""]
[null,null,null,null,null,null,null,null,"",null,"","","","",""]
[null,null,null,null,null,null,null,null,"",null,"","","","",""]
[null,null,null,null,null,null,null,null,"",null,"","","","",""]
[null,null,null,null,null,null,null,null,"",null,"","","","",""]
[null,null,null,null,null,null,null,null,"",null,"","","","",""]
[null,null,null,null,null,null,null,null,"",null,"","","","",""]
[null,null,null,null,null,null,null,null,"",null,"","","","",""]
[null,null,null,null,null,null,null,null,"",null,"","","","",""]
[null,null,null,null,null,null,null,null,"",null,"","","","",""]
[null,null,null,null,null,null,null,null,"",null,"","","","",""]
[null,null,null,null,null,null,null,null,"",null,"","","","",""]
[null,null,null,null,null,null,null,null,"",null,"","","","",""]
[null,null,null,null,null,null,null,null,"",null,"","","","",""]
[null,null,null,null,null,null,null,null,"",null,"","","","",""]
[null,null,null,null,null,null,null,null,"",null,"","","","",""]
[null,null,null,null,null,null,null,null,"",null,"","","","",""]
[null,null,null,null,null,null,null,null,"",null,"","","","",""]
[null,null,null,null,null,null,null,null,"",null,"","","","",""]
[null,null,null,null,null,null,null,null,"",null,"","","","",""]
[null,null,null,null,null,null,null,null,"",null,"","","","",""]
[null,null,null,null,null,null,null,null,"",null,"","","","",""]
[null,null,null,null,null,null,null,null,"",null,"","","","",""]
[null,null,null,null,null,null,null,null,"",null,"","","","",""]
[null,null,null,null,null,null,null,null,{"$f":"IF(ISERR(+B149/(D149-(C149-B149))),\"\",B149/(D149-(C149-B149)))","v":""},null,{"$f":"IF(ISERR(+(((L149-I149)/(L149*I149))*100)),\"\",(((L149-I149)/(L149*I149))*100))","v":""},{"$f":"IF(ISERR(+G149/((E149+F149+G149-H149)-(E149/$F$6)-(F149/$F$5))),\"\",G149/((E149+F149+G149-H149)-(E149/$F$6)-(F149/$F$5)))","v":""},{"$f":"IF(I149=\"\",\"\",ROUND(0.24680896+0.90993947*L149-0.02031058*K149,3))","v":""},{"$f":"IF(I149=\"\",\"\",IF(J149=\"\",ROUND(2.71828182845904^(0.5172953+0.425363978*LN(I149)^2+0.047810382*(1/2.71828182845904^K149)),3),ROUND(0.342355+0.8751137*I149-0.051843*J149,3)))","v":""},{"$f":"IF(I149=\"\",\"\",ROUND((1-N149/M149)/N149*100,1))","v":""}]
[null,null,null,null,null,null,null,null,{"$f":"IF(ISERR(+B150/(D150-(C150-B150))),\"\",B150/(D150-(C150-B150)))","v":""},null,{"$f":"IF(ISERR(+(((L150-I150)/(L150*I150))*100)),\"\",(((L150-I150)/(L150*I150))*100))","v":""},{"$f":"IF(ISERR(+G150/((E150+F150+G150-H150)-(E150/$F$6)-(F150/$F$5))),\"\",G150/((E150+F150+G150-H150)-(E150/$F$6)-(F150/$F$5)))","v":""},{"$f":"IF(I150=\"\",\"\",ROUND(0.24680896+0.90993947*L150-0.02031058*K150,3))","v":""},{"$f":"IF(I150=\"\",\"\",IF(J150=\"\",ROUND(2.71828182845904^(0.5172953+0.425363978*LN(I150)^2+0.047810382*(1/2.71828182845904^K150)),3),ROUND(0.342355+0.8751137*I150-0.051843*J150,3)))","v":""},{"$f":"IF(I150=\"\",\"\",ROUND((1-N150/M150)/N150*100,1))","v":""}]

{"sheet":"Volumetrics","index":14,"n_rows":55,"n_cols":28,"rows_kept":55,"cut":false,"hidden":false,"merged":[[38,15,38,16],[39,15,39,16],[9,25,9,26],[28,16,31,16],[28,17,31,17],[28,14,31,14],[28,15,31,15],[12,16,15,16],[12,17,15,17],[16,16,19,16],[16,17,19,17],[20,16,23,16],[20,17,23,17],[24,16,27,16],[24,17,27,17],[20,14,23,14],[20,15,23,15],[24,14,27,14],[24,15,27,15],[12,14,15,14],[12,15,15,15],[12,0,15,0],[16,0,19,0],[20,0,23,0],[24,0,27,0],[28,0,31,0],[28,9,31,9],[28,10,31,10],[28,11,31,11],[28,12,31,12],[28,13,31,13],[24,12,27,12],[24,13,27,13],[20,9,23,9],[20,10,23,10],[20,11,23,11],[20,12,23,12],[20,13,23,13],[36,6,36,8],[16,14,19,14],[16,15,19,15],[12,9,15,9],[12,10,15,10],[12,11,15,11],[12,12,15,12],[12,13,15,13],[16,9,19,9],[16,10,19,10],[16,11,19,11],[16,12,19,12],[16,13,19,13],[24,9,27,9],[24,10,27,10],[24,11,27,11]]}
["PROJECT ID:",null,{"$f":"IF(Initial_Info1!C2=\"\",\"\",Initial_Info1!C2)","v":""},null,null,"MIXTURE VOLUMETRICS",null,null,null,null,null,null,null,"=user input"]
["CONTRACTOR:",null,{"$f":"IF(MO_JMF_Std!J1=\"\",\"\",MO_JMF_Std!J1)","v":0},null,null,null,"GYRATIONS:",null,"Ninitial:",{"$f":"IF($P$3=\"Marshall\",\"\",Initial_Info1!$E$6)","v":""},"Ndesign:",{"$f":"IF($P$3=\"Marshall\",\"\",Initial_Info1!$E$7)","v":{"$error":"#N/A"}},"Nmax:",{"$f":"IF($P$3=\"Marshall\",\"\",Initial_Info1!$E$8)","v":""}]
["MIX TYPE:",null,{"$f":"IF(MO_JMF_Std!J2=\"\",\"\",MO_JMF_Std!J2)","v":""},null,null,null,"Marshall Compactive Effort:",null,null,{"$f":"IF($P$3=\"Marshall\",Initial_Info1!$E$7,\"\")","v":""},"(blows/side)",null,null,null,null,{"$f":"Initial_Info1!F7","v":"Gyratory"}]
["DATE:",null,{"$f":"IF(Initial_Info1!C9=\"\",\"\",Initial_Info1!C9)","v":"2016-01-07"},null,null,null,"MIX TEMPERATURE:",null,{"$f":"Initial_Info1!E13","v":0},"(F)","COMPACTION TEMPERATURE:",null,null,{"$f":"Initial_Info1!E14","v":0},"(F)"]
["CONTRACT:",null,{"$f":"IF(Initial_Info1!C4=\"\",\"\",Initial_Info1!C4)","v":""},null,null,null,"( Z )COMBINED Gsb:",null,{"$f":"Blending!H22","v":{"$error":"#DIV/0!"}},"( Y ) Gb:",1.03,"(X ) Gse:",{"$f":"Q49","v":""},"(W ) %Passing #200:",null,{"$f":"MO_JMF_Std!S37","v":0}]
[]
["BINDER","SPEC.",{"$f":"IF(P3=\"Marshall\",\"Specimen\",\"Ninitial\")","v":"Ninitial"},{"$f":"IF(P3=\"Marshall\",\"Marshall\",\"Ndesign\")","v":"Ndesign"},"Dry (Air)","Water","SSD","Bulk","Bulk","Maximum","Air","VMA","VFA","Absorbed","Effective","Dust/",{"$f":"IF(P3=\"Marshall\",\"Uncorrected\",\"%Gmm\")","v":"%Gmm"},{"$f":"IF(P3=\"Marshall\",\"Corrected\",IF(N2=\"\",\"\",\"% Gmm @\"))","v":""}]
[null,"NO.","Height",{"$f":"IF(P3=\"Marshall\",\"Stability\",\"Height\")","v":"Height"},"Mass","Mass","Mass","Volume","Sp.Gr.","Sp.Gr.","Voids",null,null,"AC (agg.)","AC","Effect.%AC",{"$f":"IF(P3=\"Marshall\",\"Marsh.Stab.\",\"@Ninitial\")","v":"@Ninitial"},{"$f":"IF(P3=\"Marshall\",\"Marsh.Stab.\",IF(N2=\"\",\"\",\"Nmax\"))","v":""}]
["(%)",null,{"$f":"IF(P3=\"Marshall\",\"(inches)\",\"(mm)\")","v":"(mm)"},{"$f":"IF(P3=\"Marshall\",\"(lbf)\",\"(mm)\")","v":"(mm)"},"(grams)","(grams)","(grams)","(cm3)","(---)","(---)","(%)","(%)","(%)","(%)","(%)","(RATIO)",{"$f":"IF(P3=\"Marshall\",\"(lbf)\",\"(%)\")","v":"(%)"},{"$f":"IF(N2=\"\",IF(J3=\"\",\"\",\"(lbf)\"),\"(%)\")","v":""},null,null,null,null,null,null,null,"Marshall Correlation Ratio"]
["A",null,"B","C","D","E","F","G","H","J","K","L","K","M","N","P",null,null,null,null,null,null,null,null,null,"cm3",null,"F"]
[null,null,null,null,null,null,null,"=F-E","=C/G",null,"=100*","=100-((100-","=100*","=100*Y*","=A-(M/100*","=W/N",{"$f":"IF(C7=\"Specimen\",\"\",\"=100*\")","v":"=100*"},{"$f":"IF(N2=\"\",\"\",\"=100*H/J\")","v":""},null,null,null,null,null,null,null,200,213,5.56]
[null,null,null,null,null,null,null,null,null,null,"(J-H)/J ","A)*H/Z)","(L-K)/(L)","(X-Z)/(X*Z)","(100-A))",null,{"$f":"IF(C7=\"Specimen\",\"\",\"(C*H)/(B*J)\")","v":"(C*H)/(B*J)"},null,null,"Nini","Ave. Stab.","cm3","F","Corr.",null,214,225,5]
[null,1,null,null,null,null,null,{"$f":"IF(G13=\"\",\"\",G13-F13)","v":""},{"$f":"IF(H13=\"\",\"\",E13/H13)","v":""},{"$f":"P48","v":""},{"$f":"IF(I16=\"\",\"\",ROUND(100*((J13-I16)/J13),1))","v":""},{"$f":"IF(I16=\"\",\"\",ROUND(100-(I16*(100-A13)/$I$5),1))","v":""},{"$f":"IF(I16=\"\",\"\",ROUND(100*(L13-K13)/L13,1))","v":""},{"$f":"IF(I16=\"\",\"\",ROUND(100*($K$5*(($W$48-$I$5)/($W$48*$I$5))),2))","v":""},{"$f":"IF(I16=\"\",\"\",A13-(N13/100*(100-A13)))","v":""},{"$f":"IF(I16=\"\",\"\",ROUND($P$5/O13,1))","v":""},{"$f":"IF(A13=\"\",\"\",IF($Q$9=\"(lbf)\",U14,T14))","v":""},{"$f":"IF($Q$9=\"(lbf)\",Y14,\"\")","v":""},null,null,null,{"$f":"IF(C13=\"\",\"\",ROUND(C13*2.54*PI()*(Initial_Info1!H7/2/10)^2,0))","v":""},{"$f":"INDEX($Z$11:$AB$43,MATCH(1,(V13>=$Z$11:$Z$43)*(V13<=$AA$11:$AA$43),0),3)","v":{"$error":"#N/A"}},{"$f":"IF(D13<>0,ROUND(D13*W13,0),\"\")","v":""},null,226,237,4.55]
[null,2,null,null,null,null,null,{"$f":"IF(G14=\"\",\"\",G14-F14)","v":""},{"$f":"IF(H14=\"\",\"\",E14/H14)","v":""},null,null,null,null,null,null,null,null,null,null,{"$f":"ROUND(AVERAGE(IF(ISNUMBER(D13:D15/C13:C15),(D13:D15*I13:I15)/(C13:C15*J13)*100,\"\")),1)","v":{"$error":"#DIV/0!"}},{"$f":"ROUND(AVERAGE(IF(ISNUMBER(D13:D15),D13:D15,D13)),0)","v":0},{"$f":"IF(C14=\"\",\"\",ROUND(C14*2.54*PI()*(Initial_Info1!H8/2/10)^2,0))","v":""},{"$f":"INDEX($Z$11:$AB$43,MATCH(1,(V14>=$Z$11:$Z$43)*(V14<=$AA$11:$AA$43),0),3)","v":{"$error":"#N/A"}},{"$f":"IF(D14<>0,ROUND(D14*W14,0),\"\")","v":""},{"$f":"ROUND(AVERAGE(IF(ISNUMBER(X13:X15),X13:X15,X13)),0)","v":{"$error":"#DIV/0!"}},238,250,4.17]
[null,3,null,null,null,null,null,{"$f":"IF(G15=\"\",\"\",G15-F15)","v":""},{"$f":"IF(H15=\"\",\"\",E15/H15)","v":""},null,null,null,null,null,null,null,null,null,null,null,null,{"$f":"IF(C15=\"\",\"\",ROUND(C15*2.54*PI()*(Initial_Info1!H9/2/10)^2,0))","v":""},{"$f":"INDEX($Z$11:$AB$43,MATCH(1,(V15>=$Z$11:$Z$43)*(V15<=$AA$11:$AA$43),0),3)","v":{"$error":"#N/A"}},"",null,251,264,3.85]
[null,null,null,null,null,null,null,"average",{"$f":"IF(I13=\"\",\"\",ROUND(AVERAGE(I13:I15),3))","v":""},null,null,null,null,null,null,null,null,null,null,null,null,null,null,null,null,265,276,3.57]
[null,4,null,null,null,null,null,{"$f":"IF(G17=\"\",\"\",G17-F17)","v":""},{"$f":"IF(H17=\"\",\"\",E17/H17)","v":""},{"$f":"P49","v":""},{"$f":"IF(I20=\"\",\"\",ROUND(100*((J17-I20)/J17),1))","v":""},{"$f":"IF(I20=\"\",\"\",ROUND(100-(I20*(100-A17)/$I$5),1))","v":""},{"$f":"IF(I20=\"\",\"\",ROUND(100*(L17-K17)/L17,1))","v":""},{"$f":"IF(I20=\"\",\"\",ROUND(100*($K$5*(($W$49-$I$5)/($W$49*$I$5))),2))","v":""},{"$f":"IF(I20=\"\",\"\",A17-N17)","v":""},{"$f":"IF(I20=\"\",\"\",ROUND($P$5/O17,1))","v":""},{"$f":"IF(A17=\"\",\"\",IF($Q$9=\"(lbf)\",U18,T18))","v":""},{"$f":"IF($Q$9=\"(lbf)\",Y18,\"\")","v":""},null,null,null,{"$f":"IF(C17=\"\",\"\",ROUND(C17*2.54*PI()*(Initial_Info1!H11/2/10)^2,0))","v":""},{"$f":"INDEX($Z$11:$AB$43,MATCH(1,(V17>=$Z$11:$Z$43)*(V17<=$AA$11:$AA$43),0),3)","v":{"$error":"#N/A"}},"",null,277,289,3.33]
[null,5,null,null,null,null,null,{"$f":"IF(G18=\"\",\"\",G18-F18)","v":""},{"$f":"IF(H18=\"\",\"\",E18/H18)","v":""},null,null,null,null,null,null,null,null,null,null,{"$f":"ROUND(AVERAGE(IF(ISNUMBER(D17:D19/C17:C19),(D17:D19*I17:I19)/(C17:C19*J17)*100,\"\")),1)","v":{"$error":"#DIV/0!"}},{"$f":"ROUND(AVERAGE(IF(ISNUMBER(D17:D19),D17:D19,D17)),0)","v":0},{"$f":"IF(C18=\"\",\"\",ROUND(C18*2.54*PI()*(Initial_Info1!H12/2/10)^2,0))","v":""},{"$f":"INDEX($Z$11:$AB$43,MATCH(1,(V18>=$Z$11:$Z$43)*(V18<=$AA$11:$AA$43),0),3)","v":{"$error":"#N/A"}},"",{"$f":"ROUND(AVERAGE(IF(ISNUMBER(X17:X19),X17:X19,X17)),0)","v":{"$error":"#DIV/0!"}},290,301,3.03]
[null,6,null,null,null,null,null,{"$f":"IF(G19=\"\",\"\",G19-F19)","v":""},{"$f":"IF(H19=\"\",\"\",E19/H19)","v":""},null,null,null,null,null,null,null,null,null,null,null,null,{"$f":"IF(C19=\"\",\"\",ROUND(C19*2.54*PI()*(Initial_Info1!H13/2/10)^2,0))","v":""},{"$f":"INDEX($Z$11:$AB$43,MATCH(1,(V19>=$Z$11:$Z$43)*(V19<=$AA$11:$AA$43),0),3)","v":{"$error":"#N/A"}},"",null,302,316,2.78]
[null,null,null,null,null,null,null,"average",{"$f":"IF(I17=\"\",\"\",ROUND(AVERAGE(I17:I19),3))","v":""},null,null,null,null,null,null,null,null,null,null,null,null,null,null,null,null,317,328,2.5]
[null,7,null,null,null,null,null,{"$f":"IF(G21=\"\",\"\",G21-F21)","v":""},{"$f":"IF(H21=\"\",\"\",E21/H21)","v":""},{"$f":"P50","v":""},{"$f":"IF(I24=\"\",\"\",ROUND(100*((J21-I24)/J21),1))","v":""},{"$f":"IF(I24=\"\",\"\",ROUND(100-(I24*(100-A21)/$I$5),1))","v":""},{"$f":"IF(I24=\"\",\"\",ROUND(100*(L21-K21)/L21,1))","v":""},{"$f":"IF(I24=\"\",\"\",ROUND(100*($K$5*(($W$50-$I$5)/($W$50*$I$5))),2))","v":""},{"$f":"IF(I24=\"\",\"\",A21-N21)","v":""},{"$f":"IF(I24=\"\",\"\",ROUND($P$5/O21,1))","v":""},{"$f":"IF(A21=\"\",\"\",IF($Q$9=\"(lbf)\",U22,T22))","v":""},{"$f":"IF($Q$9=\"(lbf)\",Y22,\"\")","v":""},null,null,null,{"$f":"IF(C21=\"\",\"\",ROUND(C21*2.54*PI()*(Initial_Info1!H15/2/10)^2,0))","v":""},{"$f":"INDEX($Z$11:$AB$43,MATCH(1,(V21>=$Z$11:$Z$43)*(V21<=$AA$11:$AA$43),0),3)","v":{"$error":"#N/A"}},"",null,329,340,2.27]
[null,8,null,null,null,null,null,{"$f":"IF(G22=\"\",\"\",G22-F22)","v":""},{"$f":"IF(H22=\"\",\"\",E22/H22)","v":""},null,null,null,null,null,null,null,null,null,null,{"$f":"ROUND(AVERAGE(IF(ISNUMBER(D21:D23/C21:C23),(D21:D23*I21:I23)/(C21:C23*J21)*100,\"\")),1)","v":{"$error":"#DIV/0!"}},{"$f":"ROUND(AVERAGE(IF(ISNUMBER(D21:D23),D21:D23,D21)),0)","v":0},{"$f":"IF(C22=\"\",\"\",ROUND(C22*2.54*PI()*(Initial_Info1!H16/2/10)^2,0))","v":""},{"$f":"INDEX($Z$11:$AB$43,MATCH(1,(V22>=$Z$11:$Z$43)*(V22<=$AA$11:$AA$43),0),3)","v":{"$error":"#N/A"}},"",{"$f":"ROUND(AVERAGE(IF(ISNUMBER(X21:X23),X21:X23,X21)),0)","v":{"$error":"#DIV/0!"}},341,353,2.08]
[null,9,null,null,null,null,null,{"$f":"IF(G23=\"\",\"\",G23-F23)","v":""},{"$f":"IF(H23=\"\",\"\",E23/H23)","v":""},null,null,null,null,null,null,null,null,null,null,null,null,{"$f":"IF(C23=\"\",\"\",ROUND(C23*2.54*PI()*(Initial_Info1!H17/2/10)^2,0))","v":""},{"$f":"INDEX($Z$11:$AB$43,MATCH(1,(V23>=$Z$11:$Z$43)*(V23<=$AA$11:$AA$43),0),3)","v":{"$error":"#N/A"}},"",null,354,367,1.92]
[null,null,null,null,null,null,null,"average",{"$f":"IF(I21=\"\",\"\",ROUND(AVERAGE(I21:I23),3))","v":""},null,null,null,null,null,null,null,null,null,null,null,null,null,null,null,null,368,379,1.79]
[null,10,null,null,null,null,null,{"$f":"IF(G25=\"\",\"\",G25-F25)","v":""},{"$f":"IF(H25=\"\",\"\",E25/H25)","v":""},{"$f":"P51","v":""},{"$f":"IF(I28=\"\",\"\",ROUND(100*((J25-I28)/J25),1))","v":""},{"$f":"IF(I28=\"\",\"\",ROUND(100-(I28*(100-A25)/$I$5),1))","v":""},{"$f":"IF(I28=\"\",\"\",ROUND(100*(L25-K25)/L25,1))","v":""},{"$f":"IF(I28=\"\",\"\",ROUND(100*($K$5*(($W$51-$I$5)/($W$51*$I$5))),2))","v":""},{"$f":"IF(I28=\"\",\"\",A25-N25)","v":""},{"$f":"IF(I28=\"\",\"\",ROUND($P$5/O25,1))","v":""},{"$f":"IF(A25=\"\",\"\",IF($Q$9=\"(lbf)\",U26,T26))","v":""},{"$f":"IF($Q$9=\"(lbf)\",Y26,\"\")","v":""},null,null,null,{"$f":"IF(C25=\"\",\"\",ROUND(C25*2.54*PI()*(Initial_Info1!H19/2/10)^2,0))","v":""},{"$f":"INDEX($Z$11:$AB$43,MATCH(1,(V25>=$Z$11:$Z$43)*(V25<=$AA$11:$AA$43),0),3)","v":{"$error":"#N/A"}},"",null,380,392,1.67]
[null,11,null,null,null,null,null,{"$f":"IF(G26=\"\",\"\",G26-F26)","v":""},{"$f":"IF(H26=\"\",\"\",E26/H26)","v":""},null,null,null,null,null,null,null,null,null,null,{"$f":"ROUND(AVERAGE(IF(ISNUMBER(D25:D27/C25:C27),(D25:D27*I25:I27)/(C25:C27*J25)*100,\"\")),1)","v":{"$error":"#DIV/0!"}},{"$f":"ROUND(AVERAGE(IF(ISNUMBER(D25:D27),D25:D27,D25)),0)","v":0},{"$f":"IF(C26=\"\",\"\",ROUND(C26*2.54*PI()*(Initial_Info1!H20/2/10)^2,0))","v":""},{"$f":"INDEX($Z$11:$AB$43,MATCH(1,(V26>=$Z$11:$Z$43)*(V26<=$AA$11:$AA$43),0),3)","v":{"$error":"#N/A"}},"",{"$f":"ROUND(AVERAGE(IF(ISNUMBER(X25:X27),X25:X27,X25)),0)","v":{"$error":"#DIV/0!"}},393,405,1.56]
[null,12,null,null,null,null,null,{"$f":"IF(G27=\"\",\"\",G27-F27)","v":""},{"$f":"IF(H27=\"\",\"\",E27/H27)","v":""},null,null,null,null,null,null,null,null,null,null,null,null,{"$f":"IF(C27=\"\",\"\",ROUND(C27*2.54*PI()*(Initial_Info1!H21/2/10)^2,0))","v":""},{"$f":"INDEX($Z$11:$AB$43,MATCH(1,(V27>=$Z$11:$Z$43)*(V27<=$AA$11:$AA$43),0),3)","v":{"$error":"#N/A"}},"",null,406,420,1.47]
[null,null,null,null,null,null,null,"average",{"$f":"IF(I25=\"\",\"\",ROUND(AVERAGE(I25:I27),3))","v":""},null,null,null,null,null,null,null,null,null,null,null,null,null,null,null,null,421,431,1.39]
[null,13,null,null,null,null,null,{"$f":"IF(G29=\"\",\"\",G29-F29)","v":""},{"$f":"IF(H29=\"\",\"\",E29/H29)","v":""},{"$f":"P52","v":""},{"$f":"IF(I32=\"\",\"\",ROUND(100*((J29-I32)/J29),1))","v":""},{"$f":"IF(I32=\"\",\"\",ROUND(100-(I32*(100-A29)/$I$5),1))","v":""},{"$f":"IF(I32=\"\",\"\",ROUND(100*(L29-K29)/L29,1))","v":""},{"$f":"IF(I32=\"\",\"\",ROUND(100*($K$5*(($W$52-$I$5)/($W$52*$I$5))),2))","v":""},{"$f":"IF(I32=\"\",\"\",A29-N29)","v":""},{"$f":"IF(I32=\"\",\"\",ROUND($P$5/O29,1))","v":""},{"$f":"IF(A29=\"\",\"\",IF($Q$9=\"(lbf)\",U30,T30))","v":""},{"$f":"IF($Q$9=\"(lbf)\",Y30,IF(D34>0,T31,\"\"))","v":""},null,null,null,{"$f":"IF(C29=\"\",\"\",ROUND(C29*2.54*PI()*(Initial_Info1!H23/2/10)^2,0))","v":""},{"$f":"INDEX($Z$11:$AB$43,MATCH(1,(V29>=$Z$11:$Z$43)*(V29<=$AA$11:$AA$43),0),3)","v":{"$error":"#N/A"}},"",null,432,443,1.32]
[null,14,null,null,null,null,null,{"$f":"IF(G30=\"\",\"\",G30-F30)","v":""},{"$f":"IF(H30=\"\",\"\",E30/H30)","v":""},null,null,null,null,null,null,null,null,null,null,{"$f":"ROUND(AVERAGE(IF(ISNUMBER(D34:D36/C29:C31),(D34:D36*I29:I31)/(C29:C31*J29)*100,\"\")),1)","v":{"$error":"#DIV/0!"}},{"$f":"ROUND(AVERAGE(IF(ISNUMBER(D29:D31),D29:D31,D29)),0)","v":0},{"$f":"IF(C30=\"\",\"\",ROUND(C30*2.54*PI()*(Initial_Info1!H24/2/10)^2,0))","v":""},{"$f":"INDEX($Z$11:$AB$43,MATCH(1,(V30>=$Z$11:$Z$43)*(V30<=$AA$11:$AA$43),0),3)","v":{"$error":"#N/A"}},"",{"$f":"ROUND(AVERAGE(IF(ISNUMBER(X29:X31),X29:X31,X29)),0)","v":{"$error":"#DIV/0!"}},444,456,1.25]
[null,15,null,null,null,null,null,{"$f":"IF(G31=\"\",\"\",G31-F31)","v":""},{"$f":"IF(H31=\"\",\"\",E31/H31)","v":""},null,null,null,null,null,null,null,null,null,null,{"$f":"ROUND(AVERAGE(IF(ISNUMBER(D34:D36/C29:C31),I29:I31/J29*100,\"\")),1)","v":{"$error":"#DIV/0!"}},null,{"$f":"IF(C31=\"\",\"\",ROUND(C31*2.54*PI()*(Initial_Info1!H25/2/10)^2,0))","v":""},{"$f":"INDEX($Z$11:$AB$43,MATCH(1,(V31>=$Z$11:$Z$43)*(V31<=$AA$11:$AA$43),0),3)","v":{"$error":"#N/A"}},"",null,457,470,1.19]
[null,null,{"$f":"IF(C7=\"Ninitial\",\"If Gyrated to Nmax, insert final heights below.\",\"\")","v":"If Gyrated to Nmax, insert final heights below."},null,null,null,null,"average",{"$f":"IF(I29=\"\",\"\",ROUND(AVERAGE(I29:I31),3))","v":""},null,null,null,null,null,null,null,null,null,null,"Nmax",null,null,null,null,null,471,482,1.1399999999999999]
[null,null,null,{"$f":"IF(C7=\"Ninitial\",\"Nmax\",\"\")","v":"Nmax"},null,{"$f":"IF(D34>0,\"Ndes calculated from Nmax\",\"\")","v":""},null,null,{"$f":"IF($Q$33=\"\",\"\",ROUND(J29*Q33/100,3))","v":""},{"$f":"IF($Q$33=\"\",\"\",J29)","v":""},{"$f":"IF($Q$33=\"\",\"\",ROUND(100*(J33-I33)/J33,1))","v":""},{"$f":"IF($Q$33=\"\",\"\",ROUND(100-(I33*(100-A29))/$I$5,1))","v":""},{"$f":"IF($Q$33=\"\",\"\",ROUND(100*(L33-K33)/L33,1))","v":""},{"$f":"IF(I32=\"\",\"\",ROUND(100*($K$5*(($W$52-$I$5)/($W$52*$I$5))),2))","v":""},{"$f":"IF($Q$33=\"\",\"\",A29-N33)","v":""},{"$f":"IF($Q$33=\"\",\"\",ROUND($P$5/O33,1))","v":""},{"$f":"IF($D$34>0,T33,\"\")","v":""},null,null,{"$f":"ROUND(AVERAGE(IF(ISNUMBER(D34:D36/D29:D31),(D34:D36*I29:I31)/(D29:D31*J29)*100,\"\")),1)","v":{"$error":"#DIV/0!"}},null,null,null,null,null,483,495,1.0900000000000001]
[null,null,{"$f":"IF(B29=\"\",\"\",B29)","v":13},null,null,null,null,null,null,null,null,null,null,null,null,null,null,null,null,"Ndes",null,null,null,null,null,496,508,1.04]
[null,null,{"$f":"IF(B30=\"\",\"\",B30)","v":14},null,null,null,null,null,null,null,null,null,null,null,null,null,null,null,null,null,null,null,null,null,null,509,522,1]
[null,null,{"$f":"IF(B31=\"\",\"\",B31)","v":15},null,null,null,null,null,null,null,null,null,null,null,null,null,null,null,null,"Weigh-in-Air Method ↓",null,null,null,null,null,523,535,0.96]
["MAXIMUM SPECIFIC GRAVITY",null,null,null,null,null,"Weigh-in-Water Method ↓",null,null,null,null,null,null,null,null,null,null,null,null,"Weigh-in-Water Method ↓",null,null,null,null,null,536,546,0.93]
["Binder",null,null,"(%)","A1",null,null,null,null,null,null,null,null,null,null,null,null,null,null,null,null,null,null,null,null,547,559,0.89]
["Mass of Mix and Bowl:",null,null,"(grams)","B1",null,null,null,null,null,null,null,null,"Effective Specific",null,"               100 - %ac             ",null,null,null,null,null,null,null,null,null,560,573,0.86]
["Mass of Bowl:",null,null,"(grams)","C1",null,null,null,null,null,null,null,null,"Gravity of the",null," ((100/Gmm)-(%ac/Gb))",null,null,null,null,null,null,null,null,null,574,585,0.83]
["Mass of Mix:",null,null,"(grams)","D1","=B1-C1",{"$f":"G39-G40","v":0},{"$f":"H39-H40","v":0},{"$f":"I39-I40","v":0},{"$f":"J39-J40","v":0},{"$f":"K39-K40","v":0},null,null,"Aggregate (Gse)=",null,null,null,null,null,null,null,null,null,null,null,586,598,0.81]
["Calibration:",null,null,"(grams)","E1",null,null,null,null,null,null,null,null,null,null,null,null,null,null,null,null,null,null,null,null,599,610,0.78]
["Sum:",null,null,null,"F1","=D1+E1",{"$f":"G41+G42","v":0},{"$f":"H41+H42","v":0},{"$f":"I41+I42","v":0},{"$f":"J41+J42","v":0},{"$f":"K41+K42","v":0},null,null,null,null,null,null,null,null,null,null,null,null,null,null,611,625,0.76]
["Final Weight:",null,null,"(grams)","G1",null,null,null,null,null,null,null,null,"Gmm @ other",null,null,"                        100                       "]
["Difference (Volume):",null,null,null,"H1","=F1-G1",{"$f":"G43-G44","v":0},{"$f":"H43-H44","v":0},{"$f":"I43-I44","v":0},{"$f":"J43-J44","v":0},{"$f":"K43-K44","v":0},null,null,"%AC",null,null,"((100-%ac)/Gse)+(%ac/Gac))"]
["MAXIMUM SPECIFIC ",null,null,null,null,"=D1/H1",{"$f":"IFERROR(ROUND(G41/G45,3),\"\")","v":""},{"$f":"IFERROR(ROUND(H41/H45,3),\"\")","v":""},"","","",null,null,null,null,null,null,null,null,null,"% AC","Gmm","Gse","Average","Count AC","Gmm","Mass","Height"]
["GRAVITY (w/o dryback)",null,null,null,null,null,null,null,null,null,null,null,null,null,"%AC","Gmm","Gse",null,null,null,{"$f":"IF(G38=\"\",\"\",G38)","v":""},{"$f":"IF(U47=\"\",\"\",H55)","v":""},{"$f":"IF(G38=\"\",\"\",ROUND((100-U47)/((100/V47)-(U47/$K$5)),3))","v":""},{"$f":"IF(U47=\"\",\"\",ROUND(AVERAGEIF(U48:U52,U47,V48:V52),3))","v":""},{"$f":"IF(U47=\"\",0,COUNTIF(U48:U50,U47))","v":0},{"$f":"IFERROR(IF(U47=\"\",\"\",100/(((100-U47)/$W$47)+(U47/$K$5))),\"\")","v":""}]
["SSD (dryback) Weight:",null,null,"(grams)","J1",null,null,null,null,null,null,null,null,null,{"$f":"IF(A13=\"\",\"\",A13)","v":""},{"$f":"IF(O48=\"\",\"\",IF(V48=\"\",Z48,V48))","v":""},{"$f":"IF(O48=\"\",\"\",W48)","v":""},null,null,null,{"$f":"IF(O48=\"\",\"\",O48)","v":""},{"$f":"IF(U48=\"\",\"\",IF(COUNTIF($G$38:$K$38,U48),IF(ISNUMBER(HLOOKUP(U48,$G$38:$K$53,16,FALSE)),HLOOKUP(U48,$G$38:$K$53,16,FALSE),HLOOKUP(U48,$G$38:$K$53,9,FALSE)),\"\"))","v":""},{"$f":"IF(U48=\"\",\"\",IF(V48=\"\",W47,ROUND((100-U48)/((100/V48)-(U48/$K$5)),3)))","v":""},null,null,{"$f":"IFERROR(IF(U48=\"\",\"\",100/(((100-U48)/$W$47)+(U48/$K$5))),\"\")","v":""},{"$f":"IFERROR(ROUND(AVERAGE(E13:E15),-1),\"\")","v":""},{"$f":"IFERROR(ROUND(AVERAGE(D13:D15),1),\"\")","v":""}]
["Volume Absorbed",null,null,"(grams)","K1","=J1-D1",{"$f":"IF(G48=\"\",\"\",G48-G41)","v":""},{"$f":"IF(H48=\"\",\"\",H48-H41)","v":""},{"$f":"IF(I48=\"\",\"\",I48-I41)","v":""},{"$f":"IF(J48=\"\",\"\",J48-J41)","v":""},{"$f":"IF(K48=\"\",\"\",K48-K41)","v":""},null,null,null,{"$f":"IF(A17=\"\",\"\",A17)","v":""},{"$f":"IF(O49=\"\",\"\",IF(V49=\"\",Z49,V49))","v":""},{"$f":"IF(O49=\"\",\"\",W49)","v":""},null,null,null,{"$f":"IF(O49=\"\",\"\",O49)","v":""},{"$f":"IF(U49=\"\",\"\",IF(COUNTIF($G$38:$K$38,U49),IF(ISNUMBER(HLOOKUP(U49,$G$38:$K$53,16,FALSE)),HLOOKUP(U49,$G$38:$K$53,16,FALSE),HLOOKUP(U49,$G$38:$K$53,9,FALSE)),\"\"))","v":""},{"$f":"IF(U49=\"\",\"\",ROUND((100-U49)/((100/IF(V49=\"\",Z49,V49))-(U49/$K$5)),3))","v":""},null,null,"",{"$f":"IFERROR(ROUND(AVERAGE(E17:E19),-1),\"\")","v":""},{"$f":"IFERROR(ROUND(AVERAGE(D17:D19),1),\"\")","v":""}]
["Water",null,null,null,null,null,null,null,null,null,null,null,null,null,{"$f":"IF(A21=\"\",\"\",A21)","v":""},"",{"$f":"IF(O50=\"\",\"\",W50)","v":""},null,null,null,"","","",null,null,"",{"$f":"IFERROR(ROUND(AVERAGE(E21:E23),-1),\"\")","v":""},{"$f":"IFERROR(ROUND(AVERAGE(D21:D23),1),\"\")","v":""}]
["Corrected Difference",null,null,null,"L1","=H1+K1",{"$f":"IF(G48=\"\",\"\",G45+G49)","v":""},{"$f":"IF(H48=\"\",\"\",H45+H49)","v":""},{"$f":"IF(I48=\"\",\"\",I45+I49)","v":""},{"$f":"IF(J48=\"\",\"\",J45+J49)","v":""},{"$f":"IF(K48=\"\",\"\",K45+K49)","v":""},null,null,null,{"$f":"IF(A25=\"\",\"\",A25)","v":""},"",{"$f":"IF(O51=\"\",\"\",W51)","v":""},null,null,null,"","","",null,null,"",{"$f":"IFERROR(ROUND(AVERAGE(E25:E27),-1),\"\")","v":""},{"$f":"IFERROR(ROUND(AVERAGE(D25:D27),1),\"\")","v":""}]
["(Volume):",null,null,null,null,null,null,null,null,null,null,null,null,null,{"$f":"IF(A29=\"\",\"\",A29)","v":""},"",{"$f":"IF(O52=\"\",\"\",W52)","v":""},null,null,null,"","","",null,null,"",{"$f":"IFERROR(ROUND(AVERAGE(E29:E31),-1),\"\")","v":""},{"$f":"IFERROR(ROUND(AVERAGE(D29:D31),1),\"\")","v":""}]
["MAXIMUM SPECIFIC ",null,null,null,null,"=D1/L1",{"$f":"IF(G48=\"\",\"\",G41/G51)","v":""},{"$f":"IF(H48=\"\",\"\",H41/H51)","v":""},{"$f":"IF(I48=\"\",\"\",I41/I51)","v":""},{"$f":"IF(J48=\"\",\"\",J41/J51)","v":""},{"$f":"IF(K48=\"\",\"\",K41/K51)","v":""}]
["GRAVITY (w/ DRYBACK)"]
["SINGLE POINT AVERAGE ( Gmm )",null,null,null,"M1",null,null,{"$f":"IF(COUNTIF(G38:I38,G38)>=1,IF(COUNTIF(G53:I53,\">0\"),AVERAGEIF(G38:I38,G38,G53:I53),AVERAGEIF(G38:I38,G38,G46:I46)),\"\")","v":""}]

{"sheet":"403_Graphs","index":15,"n_rows":29,"n_cols":16,"rows_kept":29,"cut":false,"hidden":false,"merged":[]}
["%","%","%","%","Max.Sp.","%Gmm","Dust /",null,null,null,null,null,"MISSOURI DEPARTMENT OF TRANSPORTATION"]
["AC","Air","VMA","VFA","Gravity","@Ninitial","%Eff. Ac",null,null,null,"CONTRACTOR:",{"$f":"Volumetrics!C2","v":0},null,null,"MIX TYPE:",{"$f":"Volumetrics!C3","v":""}]
[null,"Voids"]
[{"$f":"IF(Volumetrics!A13=\"\",NA(),Volumetrics!A13)","v":{"$error":"#N/A"}},{"$f":"Volumetrics!K13","v":""},{"$f":"Volumetrics!L13","v":""},{"$f":"Volumetrics!M13","v":""},{"$f":"Volumetrics!P48","v":""},{"$f":"Volumetrics!Q13","v":""},{"$f":"Volumetrics!P13","v":""}]
[{"$f":"IF(Volumetrics!A17=\"\",NA(),Volumetrics!A17)","v":{"$error":"#N/A"}},{"$f":"Volumetrics!K17","v":""},{"$f":"Volumetrics!L17","v":""},{"$f":"Volumetrics!M17","v":""},{"$f":"Volumetrics!P49","v":""},{"$f":"Volumetrics!Q17","v":""},{"$f":"Volumetrics!P17","v":""}]
[{"$f":"IF(Volumetrics!A21=\"\",NA(),Volumetrics!A21)","v":{"$error":"#N/A"}},{"$f":"Volumetrics!K21","v":""},{"$f":"Volumetrics!L21","v":""},{"$f":"Volumetrics!M21","v":""},{"$f":"Volumetrics!P50","v":""},{"$f":"Volumetrics!Q21","v":""},{"$f":"Volumetrics!P21","v":""}]
[{"$f":"IF(Volumetrics!A25=\"\",NA(),Volumetrics!A25)","v":{"$error":"#N/A"}},{"$f":"Volumetrics!K25","v":""},{"$f":"Volumetrics!L25","v":""},{"$f":"Volumetrics!M25","v":""},{"$f":"Volumetrics!P51","v":""},{"$f":"Volumetrics!Q25","v":""},{"$f":"Volumetrics!P25","v":""}]
[{"$f":"IF(Volumetrics!A29=\"\",NA(),Volumetrics!A29)","v":{"$error":"#N/A"}},{"$f":"Volumetrics!K29","v":""},{"$f":"Volumetrics!L29","v":""},{"$f":"Volumetrics!M29","v":""},{"$f":"Volumetrics!P52","v":""},{"$f":"Volumetrics!Q29","v":""},{"$f":"IF(Volumetrics!P29=\"\",\"\",Volumetrics!P29)","v":""}]
[]
[]
[]
[]
[]
[]
[]
[]
[]
[null,null,null,null,"DESIGN RESULTS"]
[null,null,null,"Design %AC:",null,null,{"$f":"ROUND((G20-INDEX(LINEST(N(OFFSET(B4:B7,SMALL(IF(ISNUMBER(B4:B7*A4:A7),ROW(A4:A7)-ROW(A4)),ROW(INDIRECT(\"1:\"&MIN(COUNT(B4:B7),COUNT(A4:A7))))),0,1)),N(OFFSET(A4:A7,SMALL(IF(ISNUMBER(A4:A7*B4:B7),ROW(B4:B7)-ROW(B4)),ROW(INDIRECT(\"1:\"&MIN(COUNT(A4:A7),COUNT(B4:B7))))),0,1)),TRUE),1,2))/INDEX(LINEST(N(OFFSET(B4:B7,SMALL(IF(ISNUMBER(B4:B7*A4:A7),ROW(A4:A7)-ROW(A4)),ROW(INDIRECT(\"1:\"&MIN(COUNT(B4:B7),COUNT(A4:A7))))),0,1)),N(OFFSET(A4:A7,SMALL(IF(ISNUMBER(A4:A7*B4:B7),ROW(B4:B7)-ROW(B4)),ROW(INDIRECT(\"1:\"&MIN(COUNT(A4:A7),COUNT(B4:B7))))),0,1)),TRUE),1,1),1)","v":{"$error":"#REF!"}}]
[null,null,null,"% Air Voids:",null,null,4]
[null,null,null,"%VMA:",null,null,{"$f":"ROUND(INDEX(LINEST(N(OFFSET(C4:C8,SMALL(IF(ISNUMBER(C4:C8*A4:A8),ROW(A4:A8)-ROW(A4)),ROW(INDIRECT(\"1:\"&MIN(COUNT(C4:C8),COUNT(A4:A8))))),0,1)),N(OFFSET(A4:A8,SMALL(IF(ISNUMBER(A4:A8*C4:C8),ROW(C4:C8)-ROW(C4)),ROW(INDIRECT(\"1:\"&MIN(COUNT(A4:A8),COUNT(C4:C8))))),0,1))^{1,2},TRUE),1,1)*G19^2+INDEX(LINEST(N(OFFSET(C4:C8,SMALL(IF(ISNUMBER(C4:C8*A4:A8),ROW(A4:A8)-ROW(A4)),ROW(INDIRECT(\"1:\"&MIN(COUNT(C4:C8),COUNT(A4:A8))))),0,1)),N(OFFSET(A4:A8,SMALL(IF(ISNUMBER(A4:A8*C4:C8),ROW(C4:C8)-ROW(C4)),ROW(INDIRECT(\"1:\"&MIN(COUNT(A4:A8),COUNT(C4:C8))))),0,1))^{1,2},TRUE),1,2)*G19+INDEX(LINEST(N(OFFSET(C4:C8,SMALL(IF(ISNUMBER(C4:C8*A4:A8),ROW(A4:A8)-ROW(A4)),ROW(INDIRECT(\"1:\"&MIN(COUNT(C4:C8),COUNT(A4:A8))))),0,1)),N(OFFSET(A4:A8,SMALL(IF(ISNUMBER(A4:A8*C4:C8),ROW(C4:C8)-ROW(C4)),ROW(INDIRECT(\"1:\"&MIN(COUNT(A4:A8),COUNT(C4:C8))))),0,1))^{1,2},TRUE),1,3),1)","v":{"$error":"#REF!"}}]
[null,null,null,"% VFA:",null,null,{"$f":"ROUND(INDEX(LOGEST(N(OFFSET(D4:D7,SMALL(IF(ISNUMBER(D4:D7*A4:A7),ROW(A4:A7)-ROW(A4)),ROW(INDIRECT(\"1:\"&MIN(COUNT(D4:D7),COUNT(A4:A7))))),0,1)),N(OFFSET(A4:A7,SMALL(IF(ISNUMBER(A4:A7*D4:D7),ROW(D4:D7)-ROW(D4)),ROW(INDIRECT(\"1:\"&MIN(COUNT(A4:A7),COUNT(D4:D7))))),0,1)),TRUE),1,2)*INDEX(LOGEST(N(OFFSET(D4:D7,SMALL(IF(ISNUMBER(D4:D7*A4:A7),ROW(A4:A7)-ROW(A4)),ROW(INDIRECT(\"1:\"&MIN(COUNT(D4:D7),COUNT(A4:A7))))),0,1)),N(OFFSET(A4:A7,SMALL(IF(ISNUMBER(A4:A7*D4:D7),ROW(D4:D7)-ROW(D4)),ROW(INDIRECT(\"1:\"&MIN(COUNT(A4:A7),COUNT(D4:D7))))),0,1)),TRUE),1,1)^G19,0)","v":{"$error":"#REF!"}}]
[null,null,null,"Max.Sp.Gravity",null,null,{"$f":"ROUND((INDEX(LINEST(N(OFFSET(E4:E7,SMALL(IF(ISNUMBER(E4:E7*A4:A7),ROW(A4:A7)-ROW(A4)),ROW(INDIRECT(\"1:\"&MIN(COUNT(E4:E7),COUNT(A4:A7))))),0,1)),N(OFFSET(A4:A7,SMALL(IF(ISNUMBER(A4:A7*E4:E7),ROW(E4:E7)-ROW(E4)),ROW(INDIRECT(\"1:\"&MIN(COUNT(A4:A7),COUNT(E4:E7))))),0,1)),TRUE),1,2))+G19*INDEX(LINEST(N(OFFSET(E4:E7,SMALL(IF(ISNUMBER(E4:E7*A4:A7),ROW(A4:A7)-ROW(A4)),ROW(INDIRECT(\"1:\"&MIN(COUNT(E4:E7),COUNT(A4:A7))))),0,1)),N(OFFSET(A4:A7,SMALL(IF(ISNUMBER(A4:A7*E4:E7),ROW(E4:E7)-ROW(E4)),ROW(INDIRECT(\"1:\"&MIN(COUNT(A4:A7),COUNT(E4:E7))))),0,1)),TRUE),1,1),3)","v":{"$error":"#REF!"}}]
[null,null,null,"%Gmm@Ninitial:",null,null,{"$f":"ROUND(INDEX(LINEST(N(OFFSET(F4:F8,SMALL(IF(ISNUMBER(F4:F8*A4:A8),ROW(A4:A8)-ROW(A4)),ROW(INDIRECT(\"1:\"&MIN(COUNT(F4:F8),COUNT(A4:A8))))),0,1)),N(OFFSET(A4:A8,SMALL(IF(ISNUMBER(A4:A8*F4:F8),ROW(F4:F8)-ROW(F4)),ROW(INDIRECT(\"1:\"&MIN(COUNT(A4:A8),COUNT(F4:F8))))),0,1))^{1,2},TRUE),1,1)*G19^2+INDEX(LINEST(N(OFFSET(F4:F8,SMALL(IF(ISNUMBER(F4:F8*A4:A8),ROW(A4:A8)-ROW(A4)),ROW(INDIRECT(\"1:\"&MIN(COUNT(F4:F8),COUNT(A4:A8))))),0,1)),N(OFFSET(A4:A8,SMALL(IF(ISNUMBER(A4:A8*F4:F8),ROW(F4:F8)-ROW(F4)),ROW(INDIRECT(\"1:\"&MIN(COUNT(A4:A8),COUNT(F4:F8))))),0,1))^{1,2},TRUE),1,2)*G19+INDEX(LINEST(N(OFFSET(F4:F8,SMALL(IF(ISNUMBER(F4:F8*A4:A8),ROW(A4:A8)-ROW(A4)),ROW(INDIRECT(\"1:\"&MIN(COUNT(F4:F8),COUNT(A4:A8))))),0,1)),N(OFFSET(A4:A8,SMALL(IF(ISNUMBER(A4:A8*F4:F8),ROW(F4:F8)-ROW(F4)),ROW(INDIRECT(\"1:\"&MIN(COUNT(A4:A8),COUNT(F4:F8))))),0,1))^{1,2},TRUE),1,3),1)","v":{"$error":"#REF!"}}]
[null,null,null,"%Gmm@Nmax:",null,null,{"$f":"IF(Volumetrics!Q33=\"\",\"\",Volumetrics!Q33)","v":""}]
[null,null,null,"Dust/%Effective AC ratio:",null,null,{"$f":"ROUND(INDEX(LINEST(N(OFFSET(G4:G8,SMALL(IF(ISNUMBER(G4:G8*A4:A8),ROW(A4:A8)-ROW(A4)),ROW(INDIRECT(\"1:\"&MIN(COUNT(G4:G8),COUNT(A4:A8))))),0,1)),N(OFFSET(A4:A8,SMALL(IF(ISNUMBER(A4:A8*G4:G8),ROW(G4:G8)-ROW(G4)),ROW(INDIRECT(\"1:\"&MIN(COUNT(A4:A8),COUNT(G4:G8))))),0,1))^{1,2},TRUE),1,1)*G19^2+INDEX(LINEST(N(OFFSET(G4:G8,SMALL(IF(ISNUMBER(G4:G8*A4:A8),ROW(A4:A8)-ROW(A4)),ROW(INDIRECT(\"1:\"&MIN(COUNT(G4:G8),COUNT(A4:A8))))),0,1)),N(OFFSET(A4:A8,SMALL(IF(ISNUMBER(A4:A8*G4:G8),ROW(G4:G8)-ROW(G4)),ROW(INDIRECT(\"1:\"&MIN(COUNT(A4:A8),COUNT(G4:G8))))),0,1))^{1,2},TRUE),1,2)*G19+INDEX(LINEST(N(OFFSET(G4:G8,SMALL(IF(ISNUMBER(G4:G8*A4:A8),ROW(A4:A8)-ROW(A4)),ROW(INDIRECT(\"1:\"&MIN(COUNT(G4:G8),COUNT(A4:A8))))),0,1)),N(OFFSET(A4:A8,SMALL(IF(ISNUMBER(A4:A8*G4:G8),ROW(G4:G8)-ROW(G4)),ROW(INDIRECT(\"1:\"&MIN(COUNT(A4:A8),COUNT(G4:G8))))),0,1))^{1,2},TRUE),1,3),1)","v":{"$error":"#REF!"}}]
[null,null,null,"Gmb @ Ndes:",null,null,{"$f":"ROUND((100-G20)/100*G23,3)","v":{"$error":"#REF!"}}]
[null,null,null,"Unit Weight (pcf):",null,null,{"$f":"G27*62.4","v":{"$error":"#REF!"}}]
[null,null,null,"Gse:",null,null,{"$f":"ROUND((100-G19)/((100/G23)-(G19/Volumetrics!$K$5)),3)","v":{"$error":"#REF!"}}]

{"sheet":"401_Graphs","index":16,"n_rows":28,"n_cols":16,"rows_kept":28,"cut":false,"hidden":false,"merged":[]}
["%","%","%","%","Max.Sp.","lbf","Dust /",null,null,null,null,null,"MISSOURI DEPARTMENT OF TRANSPORTATION"]
["AC","Air","VMA","VFA","Gravity","Stability","%Eff. Ac",null,null,null,"CONTRACTOR:",{"$f":"Volumetrics!C2","v":0},null,null,"MIX TYPE:",{"$f":"Volumetrics!C3","v":""}]
[null,"Voids"]
[{"$f":"IF(Volumetrics!A13=\"\",NA(),Volumetrics!A13)","v":{"$error":"#N/A"}},{"$f":"Volumetrics!K13","v":""},{"$f":"Volumetrics!L13","v":""},{"$f":"Volumetrics!M13","v":""},{"$f":"Volumetrics!P48","v":""},{"$f":"Volumetrics!R13","v":""},{"$f":"Volumetrics!P13","v":""}]
[{"$f":"IF(Volumetrics!A17=\"\",NA(),Volumetrics!A17)","v":{"$error":"#N/A"}},{"$f":"Volumetrics!K17","v":""},{"$f":"Volumetrics!L17","v":""},{"$f":"Volumetrics!M17","v":""},{"$f":"Volumetrics!P49","v":""},{"$f":"Volumetrics!R17","v":""},{"$f":"Volumetrics!P17","v":""}]
[{"$f":"IF(Volumetrics!A21=\"\",NA(),Volumetrics!A21)","v":{"$error":"#N/A"}},{"$f":"Volumetrics!K21","v":""},{"$f":"Volumetrics!L21","v":""},{"$f":"Volumetrics!M21","v":""},{"$f":"Volumetrics!P50","v":""},{"$f":"Volumetrics!R21","v":""},{"$f":"Volumetrics!P21","v":""}]
[{"$f":"IF(Volumetrics!A25=\"\",NA(),Volumetrics!A25)","v":{"$error":"#N/A"}},{"$f":"Volumetrics!K25","v":""},{"$f":"Volumetrics!L25","v":""},{"$f":"Volumetrics!M25","v":""},{"$f":"Volumetrics!P51","v":""},{"$f":"Volumetrics!R25","v":""},{"$f":"Volumetrics!P25","v":""}]
[{"$f":"IF(Volumetrics!A29=\"\",NA(),Volumetrics!A29)","v":{"$error":"#N/A"}},{"$f":"Volumetrics!K29","v":""},{"$f":"Volumetrics!L29","v":""},{"$f":"Volumetrics!M29","v":""},{"$f":"Volumetrics!P52","v":""},{"$f":"Volumetrics!R29","v":""},{"$f":"IF(Volumetrics!P29=\"\",\"\",Volumetrics!P29)","v":""}]
[]
[]
[]
[]
[]
[]
[]
[]
[]
[null,null,null,null,"DESIGN RESULTS"]
[null,null,null,"Design %AC:",null,null,{"$f":"ROUND((G20-INDEX(LINEST(N(OFFSET(B4:B8,SMALL(IF(ISNUMBER(B4:B8*A4:A8),ROW(A4:A8)-ROW(A4)),ROW(INDIRECT(\"1:\"&MIN(COUNT(B4:B8),COUNT(A4:A8))))),0,1)),N(OFFSET(A4:A8,SMALL(IF(ISNUMBER(A4:A8*B4:B8),ROW(B4:B8)-ROW(B4)),ROW(INDIRECT(\"1:\"&MIN(COUNT(A4:A8),COUNT(B4:B8))))),0,1)),TRUE),1,2))/INDEX(LINEST(N(OFFSET(B4:B8,SMALL(IF(ISNUMBER(B4:B8*A4:A8),ROW(A4:A8)-ROW(A4)),ROW(INDIRECT(\"1:\"&MIN(COUNT(B4:B8),COUNT(A4:A8))))),0,1)),N(OFFSET(A4:A8,SMALL(IF(ISNUMBER(A4:A8*B4:B8),ROW(B4:B8)-ROW(B4)),ROW(INDIRECT(\"1:\"&MIN(COUNT(A4:A8),COUNT(B4:B8))))),0,1)),TRUE),1,1),1)","v":{"$error":"#REF!"}}]
[null,null,null,"% Air Voids:",null,null,3.5]
[null,null,null,"%VMA:",null,null,{"$f":"ROUND(INDEX(LINEST(N(OFFSET(C4:C8,SMALL(IF(ISNUMBER(C4:C8*A4:A8),ROW(A4:A8)-ROW(A4)),ROW(INDIRECT(\"1:\"&MIN(COUNT(C4:C8),COUNT(A4:A8))))),0,1)),N(OFFSET(A4:A8,SMALL(IF(ISNUMBER(A4:A8*C4:C8),ROW(C4:C8)-ROW(C4)),ROW(INDIRECT(\"1:\"&MIN(COUNT(A4:A8),COUNT(C4:C8))))),0,1))^{1,2},TRUE),1,1)*G19^2+INDEX(LINEST(N(OFFSET(C4:C8,SMALL(IF(ISNUMBER(C4:C8*A4:A8),ROW(A4:A8)-ROW(A4)),ROW(INDIRECT(\"1:\"&MIN(COUNT(C4:C8),COUNT(A4:A8))))),0,1)),N(OFFSET(A4:A8,SMALL(IF(ISNUMBER(A4:A8*C4:C8),ROW(C4:C8)-ROW(C4)),ROW(INDIRECT(\"1:\"&MIN(COUNT(A4:A8),COUNT(C4:C8))))),0,1))^{1,2},TRUE),1,2)*G19+INDEX(LINEST(N(OFFSET(C4:C8,SMALL(IF(ISNUMBER(C4:C8*A4:A8),ROW(A4:A8)-ROW(A4)),ROW(INDIRECT(\"1:\"&MIN(COUNT(C4:C8),COUNT(A4:A8))))),0,1)),N(OFFSET(A4:A8,SMALL(IF(ISNUMBER(A4:A8*C4:C8),ROW(C4:C8)-ROW(C4)),ROW(INDIRECT(\"1:\"&MIN(COUNT(A4:A8),COUNT(C4:C8))))),0,1))^{1,2},TRUE),1,3),1)","v":{"$error":"#REF!"}}]
[null,null,null,"% VFA:",null,null,{"$f":"ROUND(INDEX(LINEST(N(OFFSET(D4:D8,SMALL(IF(ISNUMBER(D4:D8*A4:A8),ROW(A4:A8)-ROW(A4)),ROW(INDIRECT(\"1:\"&MIN(COUNT(D4:D8),COUNT(A4:A8))))),0,1)),N(OFFSET(A4:A8,SMALL(IF(ISNUMBER(A4:A8*D4:D8),ROW(D4:D8)-ROW(D4)),ROW(INDIRECT(\"1:\"&MIN(COUNT(A4:A8),COUNT(D4:D8))))),0,1))^{1,2},TRUE),1,1)*G19^2+INDEX(LINEST(N(OFFSET(D4:D8,SMALL(IF(ISNUMBER(D4:D8*A4:A8),ROW(A4:A8)-ROW(A4)),ROW(INDIRECT(\"1:\"&MIN(COUNT(D4:D8),COUNT(A4:A8))))),0,1)),N(OFFSET(A4:A8,SMALL(IF(ISNUMBER(A4:A8*D4:D8),ROW(D4:D8)-ROW(D4)),ROW(INDIRECT(\"1:\"&MIN(COUNT(A4:A8),COUNT(D4:D8))))),0,1))^{1,2},TRUE),1,2)*G19+INDEX(LINEST(N(OFFSET(D4:D8,SMALL(IF(ISNUMBER(D4:D8*A4:A8),ROW(A4:A8)-ROW(A4)),ROW(INDIRECT(\"1:\"&MIN(COUNT(D4:D8),COUNT(A4:A8))))),0,1)),N(OFFSET(A4:A8,SMALL(IF(ISNUMBER(A4:A8*D4:D8),ROW(D4:D8)-ROW(D4)),ROW(INDIRECT(\"1:\"&MIN(COUNT(A4:A8),COUNT(D4:D8))))),0,1))^{1,2},TRUE),1,3),0)","v":{"$error":"#REF!"}}]
[null,null,null,"Max.Sp.Gravity",null,null,{"$f":"ROUND((INDEX(LINEST(N(OFFSET(E4:E8,SMALL(IF(ISNUMBER(E4:E8*A4:A8),ROW(A4:A8)-ROW(A4)),ROW(INDIRECT(\"1:\"&MIN(COUNT(E4:E8),COUNT(A4:A8))))),0,1)),N(OFFSET(A4:A8,SMALL(IF(ISNUMBER(A4:A8*E4:E8),ROW(E4:E8)-ROW(E4)),ROW(INDIRECT(\"1:\"&MIN(COUNT(A4:A8),COUNT(E4:E8))))),0,1)),TRUE),1,2))+G19*INDEX(LINEST(N(OFFSET(E4:E8,SMALL(IF(ISNUMBER(E4:E8*A4:A8),ROW(A4:A8)-ROW(A4)),ROW(INDIRECT(\"1:\"&MIN(COUNT(E4:E8),COUNT(A4:A8))))),0,1)),N(OFFSET(A4:A8,SMALL(IF(ISNUMBER(A4:A8*E4:E8),ROW(E4:E8)-ROW(E4)),ROW(INDIRECT(\"1:\"&MIN(COUNT(A4:A8),COUNT(E4:E8))))),0,1)),TRUE),1,1),3)","v":{"$error":"#REF!"}}]
[null,null,null,"Stability:",null,null,{"$f":"ROUND(INDEX(LINEST(N(OFFSET(F4:F8,SMALL(IF(ISNUMBER(F4:F8*A4:A8),ROW(A4:A8)-ROW(A4)),ROW(INDIRECT(\"1:\"&MIN(COUNT(F4:F8),COUNT(A4:A8))))),0,1)),N(OFFSET(A4:A8,SMALL(IF(ISNUMBER(A4:A8*F4:F8),ROW(F4:F8)-ROW(F4)),ROW(INDIRECT(\"1:\"&MIN(COUNT(A4:A8),COUNT(F4:F8))))),0,1))^{1,2},TRUE),1,1)*G19^2+INDEX(LINEST(N(OFFSET(F4:F8,SMALL(IF(ISNUMBER(F4:F8*A4:A8),ROW(A4:A8)-ROW(A4)),ROW(INDIRECT(\"1:\"&MIN(COUNT(F4:F8),COUNT(A4:A8))))),0,1)),N(OFFSET(A4:A8,SMALL(IF(ISNUMBER(A4:A8*F4:F8),ROW(F4:F8)-ROW(F4)),ROW(INDIRECT(\"1:\"&MIN(COUNT(A4:A8),COUNT(F4:F8))))),0,1))^{1,2},TRUE),1,2)*G19+INDEX(LINEST(N(OFFSET(F4:F8,SMALL(IF(ISNUMBER(F4:F8*A4:A8),ROW(A4:A8)-ROW(A4)),ROW(INDIRECT(\"1:\"&MIN(COUNT(F4:F8),COUNT(A4:A8))))),0,1)),N(OFFSET(A4:A8,SMALL(IF(ISNUMBER(A4:A8*F4:F8),ROW(F4:F8)-ROW(F4)),ROW(INDIRECT(\"1:\"&MIN(COUNT(A4:A8),COUNT(F4:F8))))),0,1))^{1,2},TRUE),1,3),1)","v":{"$error":"#REF!"}}]
[null,null,null,"Dust/%Effective AC ratio:",null,null,{"$f":"ROUND(INDEX(LINEST(N(OFFSET(G4:G8,SMALL(IF(ISNUMBER(G4:G8*A4:A8),ROW(A4:A8)-ROW(A4)),ROW(INDIRECT(\"1:\"&MIN(COUNT(G4:G8),COUNT(A4:A8))))),0,1)),N(OFFSET(A4:A8,SMALL(IF(ISNUMBER(A4:A8*G4:G8),ROW(G4:G8)-ROW(G4)),ROW(INDIRECT(\"1:\"&MIN(COUNT(A4:A8),COUNT(G4:G8))))),0,1))^{1,2},TRUE),1,1)*G19^2+INDEX(LINEST(N(OFFSET(G4:G8,SMALL(IF(ISNUMBER(G4:G8*A4:A8),ROW(A4:A8)-ROW(A4)),ROW(INDIRECT(\"1:\"&MIN(COUNT(G4:G8),COUNT(A4:A8))))),0,1)),N(OFFSET(A4:A8,SMALL(IF(ISNUMBER(A4:A8*G4:G8),ROW(G4:G8)-ROW(G4)),ROW(INDIRECT(\"1:\"&MIN(COUNT(A4:A8),COUNT(G4:G8))))),0,1))^{1,2},TRUE),1,2)*G19+INDEX(LINEST(N(OFFSET(G4:G8,SMALL(IF(ISNUMBER(G4:G8*A4:A8),ROW(A4:A8)-ROW(A4)),ROW(INDIRECT(\"1:\"&MIN(COUNT(G4:G8),COUNT(A4:A8))))),0,1)),N(OFFSET(A4:A8,SMALL(IF(ISNUMBER(A4:A8*G4:G8),ROW(G4:G8)-ROW(G4)),ROW(INDIRECT(\"1:\"&MIN(COUNT(A4:A8),COUNT(G4:G8))))),0,1))^{1,2},TRUE),1,3),1)","v":{"$error":"#REF!"}}]
[null,null,null,{"$f":"\"Gmb @ \"&G19&\"% AC:\"","v":{"$error":"#REF!"}},null,null,{"$f":"ROUND((100-G20)/100*G23,3)","v":{"$error":"#REF!"}}]
[null,null,null,"Unit Weight (pcf):",null,null,{"$f":"((100-G20)/100)*G23*62.4","v":{"$error":"#REF!"}}]
[null,null,null,"Gse:",null,null,{"$f":"ROUND((100-G19)/((100/G23)-(G19/Volumetrics!$K$5)),3)","v":{"$error":"#REF!"}}]

{"sheet":"RAP_RAS","index":17,"n_rows":36,"n_cols":23,"rows_kept":36,"cut":false,"hidden":false,"merged":[[13,13,13,17],[15,17,15,19],[32,17,32,19],[33,17,33,19],[34,17,34,19],[14,17,14,19],[14,11,14,13],[15,11,15,13],[32,11,32,13],[33,11,33,13],[34,11,34,13],[14,14,14,16],[15,14,15,16],[32,14,32,16],[33,14,33,16],[34,14,34,16],[14,8,14,10],[15,8,15,10],[32,8,32,10],[33,8,33,10],[34,8,34,10],[14,20,14,22],[15,20,15,22],[32,20,32,22],[33,20,33,22],[34,20,34,22]]}
[null,null,null,null,null,"RECYCLE ANALYSIS"]
[]
[null,"TESTING:",null,"(Include RAP/RAS Extraction and Gradation Data on Separate Sheet.)"]
[]
[null,null,"(1)","Extraction Test: per AASHTO T 164, Method A with mineral matter determination"]
[null,null,null,"by high-speed centrifuge."]
[]
[null,null,"(2)","Wet Sieve Analysis of Extracted Aggregate: per AASHTO T30"]
[]
[null,null,"(3)","Maximum Specific Gravity value of RAP with Dryback (per AASHTO T 209), THEN Gse VALUE BY:"]
[]
[null,null,null,"Gse = ( 100 - %ac)/((100/Gmm)-(%ac/specific gravity of ac))"]
[]
[null,null,null,null,null,null,null,null,null,null,null,null,null,"Recycled Material ID ↓"]
[null,null,"MAXIMUM SPECIFIC GRAVITY"]
[null,null,"% AC",null,null,"(%)","A1",null,{"$f":"IF(I36=0,\"\",I36)","v":""},null,null,{"$f":"IF(L36=0,\"\",L36)","v":""},null,null,{"$f":"IF(O36=0,\"\",O36)","v":""},null,null,{"$f":"IF(R36=0,\"\",R36)","v":""},null,null,{"$f":"IF(U36=0,\"\",U36)","v":""}]
[null,null,"Weight of Mix and Bowl:",null,null,"(grams)","B1"]
[null,null,"Weight of Bowl:",null,null,"(grams)","C1"]
[null,null,"Weight of Mix:",null,null,"(grams)","D1","=B1-C1",{"$f":"I17-I18","v":0},0,0,0,0,0,0,0,0,{"$f":"R17-R18","v":0},{"$f":"S17-S18","v":0},{"$f":"T17-T18","v":0},0,0,0]
[null,null,"Calibration:",null,null,"(grams)","E1"]
[null,null,"Sum:",null,null,null,"F1","=D1+E1",{"$f":"I19+I20","v":0},0,0,0,0,0,0,0,0,{"$f":"R19+R20","v":0},{"$f":"S19+S20","v":0},{"$f":"T19+T20","v":0},0,0,0]
[null,null,"Final Weight:",null,null,"(grams)","G1"]
[null,null,"Difference (Volume):",null,null,null,"H1","=F1-G1",{"$f":"I21-I22","v":0},0,0,0,0,0,0,0,0,{"$f":"R21-R22","v":0},{"$f":"S21-S22","v":0},{"$f":"T21-T22","v":0},0,0,0]
[null,null,"MAXIMUM SPECIFIC ",null,null,null,null,"=D1/H1",{"$f":"IFERROR(ROUND(I19/I23,3),\"\")","v":""},{"$f":"IFERROR(ROUND(J19/J23,3),\"\")","v":""},"","","","","","","","","","","","",""]
[null,null,"GRAVITY (w/o dryback)"]
[null,null,"SSD (dryback) Weight:",null,null,"(grams)","J1"]
[null,null,"Volume Absorbed",null,null,"(grams)","K1","=J1-D1",{"$f":"IF(I26=\"\",\"\",I26-I19)","v":""},"","","","","","","","",{"$f":"IF(R26=\"\",\"\",R26-R19)","v":""},{"$f":"IF(S26=\"\",\"\",S26-S19)","v":""},{"$f":"IF(T26=\"\",\"\",T26-T19)","v":""},"","",""]
[null,null,"Water"]
[null,null,"Corrected Difference",null,null,null,"L1","=H1+K1",{"$f":"IF(I26=\"\",\"\",I23+I27)","v":""},"","","","","","","","",{"$f":"IF(R26=\"\",\"\",R23+R27)","v":""},{"$f":"IF(S26=\"\",\"\",S23+S27)","v":""},{"$f":"IF(T26=\"\",\"\",T23+T27)","v":""},"","",""]
[null,null,"(Volume):"]
[null,null,"MAXIMUM SPECIFIC ",null,null,null,null,"=D1/L1",{"$f":"IF(I26=\"\",\"\",I19/I29)","v":""},{"$f":"IF(J26=\"\",\"\",J19/J29)","v":""},{"$f":"IF(K26=\"\",\"\",K19/K29)","v":""},{"$f":"IF(L26=\"\",\"\",L19/L29)","v":""},"","","","","","","","","","",{"$f":"IF(W26=\"\",\"\",W19/W29)","v":""}]
[null,null,"GRAVITY (w/ DRYBACK)"]
[null,null,"AVERAGE ( Gmm )",null,null,null,"M1",null,{"$f":"IF(I16=\"\",\"\",IF(AND(I31=\"\",J31=\"\",K31=\"\"),AVERAGE(I24:K24),AVERAGE(I31:K31)))","v":""},null,null,{"$f":"IF(L16=\"\",\"\",IF(AND(L31=\"\",M31=\"\",N31=\"\"),AVERAGE(L24:N24),AVERAGE(L31:N31)))","v":""},null,null,{"$f":"IF(O16=\"\",\"\",IF(AND(O31=\"\",P31=\"\",Q31=\"\"),AVERAGE(O24:Q24),AVERAGE(O31:Q31)))","v":""},null,null,{"$f":"IF(R16=\"\",\"\",IF(AND(R31=\"\",S31=\"\",T31=\"\"),AVERAGE(R24:T24),AVERAGE(R31:T31)))","v":""},null,null,{"$f":"IF(U16=\"\",\"\",IF(AND(U31=\"\",V31=\"\",W31=\"\"),AVERAGE(U24:W24),AVERAGE(U31:W31)))","v":""}]
[null,null,"Effective Specific Gravity",null,null,"=((100-%ac)/(100/Gmm)-(%ac/1.030))",null,null,{"$f":"IF(I16=\"\",\"\",(100-I16)/((100/I33)-(I16/1.03)))","v":""},null,null,{"$f":"IF(L16=\"\",\"\",(100-L16)/((100/L33)-(L16/1.03)))","v":""},null,null,{"$f":"IF(O16=\"\",\"\",(100-O16)/((100/O33)-(O16/1.03)))","v":""},null,null,{"$f":"IF(R16=\"\",\"\",(100-R16)/((100/R33)-(R16/1.03)))","v":""},null,null,{"$f":"IF(U16=\"\",\"\",(100-U16)/((100/U33)-(U16/1.03)))","v":""}]
[null,null,"Gsb - Gse * 0.98",null,null,null,null,null,{"$f":"IF(I34=\"\",\"\",ROUND(I34*0.98,3))","v":""},null,null,{"$f":"IF(L34=\"\",\"\",ROUND(L34*0.98,3))","v":""},null,null,{"$f":"IF(O34=\"\",\"\",ROUND(O34*0.98,3))","v":""},null,null,{"$f":"IF(R34=\"\",\"\",ROUND(R34*0.98,3))","v":""},null,null,{"$f":"IF(U34=\"\",\"\",ROUND(U34*0.98,3))","v":""}]
[null,null,null,null,null,null,null,null,{"$f":"IF(OR(MATCH(TRUE,(AgPlant=Initial_Info1!$F$2),0)=0,ISNA(MATCH(1,(AgMID=I$15)*(AgPlant=Initial_Info1!$F$2),0))),INDEX(Aggs,MATCH(TRUE,(AgMID=I$15),0),28),INDEX(Aggs,MATCH(1,(AgMID=I$15)*(AgPlant=Initial_Info1!$F$2),0),28))","v":0},null,null,{"$f":"IF(OR(MATCH(TRUE,(AgPlant=Initial_Info1!$F$2),0)=0,ISNA(MATCH(1,(AgMID=L$15)*(AgPlant=Initial_Info1!$F$2),0))),INDEX(Aggs,MATCH(TRUE,(AgMID=L$15),0),28),INDEX(Aggs,MATCH(1,(AgMID=L$15)*(AgPlant=Initial_Info1!$F$2),0),28))","v":0},null,null,{"$f":"IF(OR(MATCH(TRUE,(AgPlant=Initial_Info1!$F$2),0)=0,ISNA(MATCH(1,(AgMID=O$15)*(AgPlant=Initial_Info1!$F$2),0))),INDEX(Aggs,MATCH(TRUE,(AgMID=O$15),0),28),INDEX(Aggs,MATCH(1,(AgMID=O$15)*(AgPlant=Initial_Info1!$F$2),0),28))","v":0},null,null,{"$f":"IF(OR(MATCH(TRUE,(AgPlant=Initial_Info1!$F$2),0)=0,ISNA(MATCH(1,(AgMID=R$15)*(AgPlant=Initial_Info1!$F$2),0))),INDEX(Aggs,MATCH(TRUE,(AgMID=R$15),0),28),INDEX(Aggs,MATCH(1,(AgMID=R$15)*(AgPlant=Initial_Info1!$F$2),0),28))","v":0},null,null,{"$f":"IF(OR(MATCH(TRUE,(AgPlant=Initial_Info1!$F$2),0)=0,ISNA(MATCH(1,(AgMID=U$15)*(AgPlant=Initial_Info1!$F$2),0))),INDEX(Aggs,MATCH(TRUE,(AgMID=U$15),0),28),INDEX(Aggs,MATCH(1,(AgMID=U$15)*(AgPlant=Initial_Info1!$F$2),0),28))","v":0}]

{"sheet":"Recycle_Binder_Contrib","index":18,"n_rows":38,"n_cols":13,"rows_kept":38,"cut":false,"hidden":false,"merged":[[22,5,22,6],[23,5,23,6],[21,2,21,6]]}
[null,"Contribution of Binder from Recycled Materials"]
[]
[null,null,null,"Effective Binder Computation"]
["Pb",{"$f":"MO_JMF_Std!S41","v":5.4},null,"Gmm",{"$f":"MO_JMF_Std!C38","v":{"$error":"#DIV/0!"}},"Gse",{"$f":"(100-B4)/(100/E4-B4/E5)","v":{"$error":"#DIV/0!"}},null,null,null,null,"Type of Stockpile"]
["Pbmv",{"$f":"B4-B23","v":5.4},null,"Gb",{"$f":"MO_JMF_Std!L20","v":0},"Pba",{"$f":"100*E5*(G4-E6)/E6/G4","v":{"$error":"#DIV/0!"}},null,null,null,null,"virgin","- Quarried aggregate"]
[null,null,null,"Gsb",{"$f":"MO_JMF_Std!C40","v":{"$error":"#DIV/0!"}},"Pbe",{"$f":"ROUND(B4-(G5/100*(100-B4)),2)","v":{"$error":"#DIV/0!"}},null,null,null,null,"reclaim","- Reclaimed aggregate such as concrete, steel slag, wet bottom slag, chat"]
[null,null,null,null,null,null,null,null,null,null,null,"RAP","- Reclaimed asphalt pavement"]
["Stockpile","Type","Ps","Pbr","Psr x Pbr","Psmv","Psmr","Pbmr",null,null,null,"RAS","- Reclaimed asphalt shingles"]
[1,"Virgin",{"$f":"100-SUM(C10:C13)","v":100},null,{"$f":"IF(D9:D16=\"\",\"\",C9:C16*D9:D16/100)","v":""},{"$f":"IF(OR($B$9:$B$16=\"virgin\",$B$9:$B$16=\"reclaim\"),ROUND(C$9:$C$16*(100-$B$4)/(100-SUM(Ps_Pbr)),2),\"\")","v":94.6},{"$f":"IF(OR(B9=\"RAP\",B9=\"RAS\"),ROUND((C9-E9)/(100-SUM(Ps_Pbr))*(100-$B$4),2),\"\")","v":""},{"$f":"IF(OR(B9:B16=\"RAP\",B9:B16=\"RAS\"),ROUND($E$9:$E$16*(100-$B$4)/100,2),\"\")","v":""}]
[{"$f":"IF(MO_JMF_Std!Z14=\"\",\"\",MO_JMF_Std!Z14)","v":0},{"$f":"IF(Initial_Info1!E42=\"\",\"\",LEFT(Initial_Info1!E42,3))","v":"0"},{"$f":"IF(B10=\"\",\"\",MO_JMF_Std!AI14)","v":0},{"$f":"IF(Initial_Info1!F42=\"\",\"\",Initial_Info1!F42)","v":0},0,{"$f":"IF(OR($B$9:$B$16=\"virgin\",$B$9:$B$16=\"reclaim\"),ROUND(C$9:$C$16*(100-$B$4)/(100-SUM(Ps_Pbr)),2),\"\")","v":""},"",{"$f":"IF(OR(B9:B16=\"RAP\",B9:B16=\"RAS\"),ROUND($E$9:$E$16*(100-$B$4)/100,2),\"\")","v":""}]
[{"$f":"IF(MO_JMF_Std!Z15=\"\",\"\",MO_JMF_Std!Z15)","v":0},{"$f":"IF(Initial_Info1!E43=\"\",\"\",LEFT(Initial_Info1!E43,3))","v":"0"},{"$f":"MO_JMF_Std!AI15","v":0},{"$f":"IF(Initial_Info1!F43=\"\",\"\",Initial_Info1!F43)","v":0},0,{"$f":"IF(OR($B$9:$B$16=\"virgin\",$B$9:$B$16=\"reclaim\"),ROUND(C$9:$C$16*(100-$B$4)/(100-SUM(Ps_Pbr)),2),\"\")","v":""},"",{"$f":"IF(OR(B9:B16=\"RAP\",B9:B16=\"RAS\"),ROUND($E$9:$E$16*(100-$B$4)/100,2),\"\")","v":""}]
[{"$f":"IF(MO_JMF_Std!Z16=\"\",\"\",MO_JMF_Std!Z16)","v":0},{"$f":"IF(Initial_Info1!E44=\"\",\"\",LEFT(Initial_Info1!E44,3))","v":"0"},{"$f":"MO_JMF_Std!AI16","v":0},{"$f":"IF(Initial_Info1!F44=\"\",\"\",Initial_Info1!F44)","v":0},0,{"$f":"IF(OR($B$9:$B$16=\"virgin\",$B$9:$B$16=\"reclaim\"),ROUND(C$9:$C$16*(100-$B$4)/(100-SUM(Ps_Pbr)),2),\"\")","v":""},"",{"$f":"IF(OR(B9:B16=\"RAP\",B9:B16=\"RAS\"),ROUND($E$9:$E$16*(100-$B$4)/100,2),\"\")","v":""}]
[{"$f":"IF(MO_JMF_Std!Z17=\"\",\"\",MO_JMF_Std!Z17)","v":0},{"$f":"IF(Initial_Info1!E45=\"\",\"\",LEFT(Initial_Info1!E45,3))","v":"0"},{"$f":"MO_JMF_Std!AI17","v":0},{"$f":"IF(Initial_Info1!F45=\"\",\"\",Initial_Info1!F45)","v":0},0,{"$f":"IF(OR($B$9:$B$16=\"virgin\",$B$9:$B$16=\"reclaim\"),ROUND(C$9:$C$16*(100-$B$4)/(100-SUM(Ps_Pbr)),2),\"\")","v":""},{"$f":"IF(OR(B13=\"RAP\",B13=\"RAS\"),ROUND((C13-E13)/(100-SUM(Ps_Pbr))*(100-$B$4),2),\"\")","v":""},{"$f":"IF(OR(B9:B16=\"RAP\",B9:B16=\"RAS\"),ROUND($E$9:$E$16*(100-$B$4)/100,2),\"\")","v":""}]
[6,null,null,null,"",{"$f":"IF(OR($B$9:$B$16=\"virgin\",$B$9:$B$16=\"reclaim\"),ROUND(C$9:$C$16*(100-$B$4)/(100-SUM(Ps_Pbr)),2),\"\")","v":""},"",{"$f":"IF(OR(B9:B16=\"RAP\",B9:B16=\"RAS\"),ROUND($E$9:$E$16*(100-$B$4)/100,2),\"\")","v":""}]
[7,null,null,null,"",{"$f":"IF(OR($B$9:$B$16=\"virgin\",$B$9:$B$16=\"reclaim\"),ROUND(C$9:$C$16*(100-$B$4)/(100-SUM(Ps_Pbr)),2),\"\")","v":""},"",{"$f":"IF(OR(B9:B16=\"RAP\",B9:B16=\"RAS\"),ROUND($E$9:$E$16*(100-$B$4)/100,2),\"\")","v":""}]
[8,null,null,null,"",{"$f":"IF(OR($B$9:$B$16=\"virgin\",$B$9:$B$16=\"reclaim\"),ROUND(C$9:$C$16*(100-$B$4)/(100-SUM(Ps_Pbr)),2),\"\")","v":""},"",{"$f":"IF(OR(B9:B16=\"RAP\",B9:B16=\"RAS\"),ROUND($E$9:$E$16*(100-$B$4)/100,2),\"\")","v":""}]
[null,null,{"$f":"SUM(Ps)","v":100},null,null,{"$f":"SUM(Psmv,Psmr)","v":94.6}]
["Pbe",{"$f":"G6","v":{"$error":"#DIV/0!"}}]
["Pbev",{"$f":"IF(B6>0,B6-G5,IF(B5>0,B5-G5,B4-G5))","v":{"$error":"#DIV/0!"}}]
["Psmv",{"$f":"SUM(Psmv)","v":94.6}]
["Psr x Pbr",{"$f":"SUM(Ps_Pbr)","v":0}]
["Psmr",{"$f":"SUM(Psmr)","v":0},"ASPHALT BINDER REPLACEMENT"]
["Pbmr",{"$f":"ROUND(SUM(Pbmr),2)","v":0},"% RAP","% RAS","Total","RAP + 2 * RAS"]
["R",{"$f":"ROUND(100*B19/B18,0)","v":{"$error":"#DIV/0!"}},{"$f":"IFERROR(ROUND((100-B24)*SUMIF(B10:B13,\"RAP\",H10:H13)/B23,0),\"\")","v":""},{"$f":"IFERROR(ROUND((100-B24)*SUMIF(B10:B13,\"RAS\",H10:H13)/B23,0),\"\")","v":""},{"$f":"C24+D24","v":{"$error":"#VALUE!"}},{"$f":"C24+2*D24","v":{"$error":"#VALUE!"}}]
[]
[]
[]
["Pb","- Percent total binder in mixture"]
["Psv(1,2,..)","- Pecent stone by fraction for virgin or reclaimed aggregate"]
["Psr(1,2,..)","- Pecent stone by fraction for RAP or RAS aggregate"]
["Pbr(1,2,..)","- Percent binder by fraction in RAP or RAS"]
["Psmv(1,2,..)","- Pecent stone by fraction for virgin or reclaimed aggregate by weight of total mixture"]
["Psmr(1,2,..)","- Pecent stone by fraction for RAP or RAS aggregate by weight of total mixture"]
["Psmr","- Pecent stone of RAP or RAS aggregate by weight of total mixture"]
["Pbmr(1,2,..)","- Percent binder by fraction in RAP or RAS by weight of total mixture"]
["Pbmr","- Percent binder of RAP or RAS by weight of total mixture"]
["Pbmv","- Pecent new binder by weight of total mixture"]
["R ","- Percentage of new binder (Pbev) to total binder (Pbe)"]

{"sheet":"T_283","index":19,"n_rows":42,"n_cols":13,"rows_kept":42,"cut":false,"hidden":false,"merged":[[37,7,38,7],[37,8,38,8],[37,9,38,9],[37,10,38,10],[41,3,41,10],[37,3,38,3],[37,4,38,4],[37,5,38,5],[37,6,38,6],[35,11,36,11],[37,11,38,11],[35,8,36,8],[35,9,36,9],[35,10,36,10],[35,3,36,3],[35,4,36,4],[35,5,36,5],[35,6,36,6],[35,7,36,7],[3,2,3,4],[4,2,4,4],[5,2,5,4],[6,2,6,4],[7,2,7,4],[3,7,3,9],[4,7,4,9],[5,7,5,9],[6,7,6,9],[7,7,7,9]]}
[null,null,null,null,null,"RESISTANCE OF COMPACTED BITUMINOUS MIXTURE"]
[null,null,null,null,null,"TO MOISTURE INDUCED DAMAGE (AASHTO  T 283)"]
[]
["Contractor",null,{"$f":"Initial_Info1!C3","v":0},null,null,null,"Project No.:",{"$f":"Initial_Info1!C4","v":0}]
["Mix Type",null,{"$f":"Initial_Info1!C7&Initial_Info1!D7","v":""},null,null,null,"Route:",{"$f":"Initial_Info1!C6","v":0}]
["Antistrip Agent",null,null,null,null,null,"County:",{"$f":"Initial_Info1!C5","v":0}]
["% AC",null,null,null,null,null,"Sublot:"]
["DATE:",null,null,null,null,null,"Sample Date:"]
[]
["Test",null,null,false,false,false,false,false,false,false,false]
["Sample No.",null,null,1,2,3,4,5,6,7,8]
["Diameter ↓","in","D",null,{"$f":"IF($D$12=\"\",\"\",$D$12)","v":""},{"$f":"IF($D$12=\"\",\"\",$D$12)","v":""},"","","","","",null,"mm"]
["Thickness",{"$f":"B12","v":"in"},"t",null,null,null,null,null,null,null,null,null,"in"]
["Dry Mass, grams",null,"A",null,null,null,null,null,null,null,null,null,{"$f":"IFERROR(ROUND(AVERAGEIF(D10:K10,TRUE,D14:K14),0),\"\")","v":""}]
["SSD Mass, grams",null,"B"]
["Water Mass, grams",null,"C"]
["Volume(B-C)",null,"E",{"$f":"IF(D15=\"\",\"\",IF(LEFT($C$5,2)=\"UB\",ROUND(D13*PI()*D12^2/4/1000,1),D15-D16))","v":""},{"$f":"IF(E15=\"\",\"\",IF(LEFT($C$5,2)=\"UB\",ROUND(E13*PI()*E12^2/4/1000,1),E15-E16))","v":""},"","","","","",""]
["Gmb(A/E)",null,"F",{"$f":"IFERROR(ROUND(D14/D17,3),\"\")","v":""},{"$f":"IFERROR(ROUND(E14/E17,3),\"\")","v":""},"","","","","",""]
["Gmm",null,"G",null,{"$f":"IF($D$19=\"\",\"\",$D$19)","v":""},{"$f":"IF($D$19=\"\",\"\",$D$19)","v":""},"","","","",""]
["%Voids[100*(G-F)/G]",null,"H",{"$f":"IF(D10=FALSE,\"\",IFERROR(100*(D19-D18)/D19,\"\"))","v":""},{"$f":"IF(E10=FALSE,\"\",IFERROR(100*(E19-E18)/E19,\"\"))","v":""},"","","","","",""]
[null,null,null,null,"Voids All",{"$f":"IFERROR(AVERAGEIF(D10:K10,TRUE,D23:K23),\"\")","v":""},"Voids Dry",{"$f":"IFERROR(AVERAGEIF(D22:K22,FALSE,D23:K23),\"\")","v":""},"Voids Wet",{"$f":"IFERROR(AVERAGEIF(D22:K22,TRUE,D23:K23),\"\")","v":""}]
["Condition Set Check",null,null,false,false,false,false,false,false,false,false]
["Volume Voids[H*E/100]",null,"I",{"$f":"IF(D20=\"\",\"\",D20*D17/100)","v":""},"","","","","","",""]
["Load, (Dry) ↓","lbf","P",null,null,null,null,null,null,null,null,null,"Newtons"]
[null,null,null,null,null,null,null,null,null,null,null,null,"lbf"]
["70% Sat. Mass",null,0.7,{"$f":"IF(D23=\"\",\"\",IF(D22=FALSE,\"\",ROUND(D14+D23*0.7,1)))","v":""},"","","","","","",""]
["80% Sat. Mass",null,0.8,{"$f":"IF(D23=\"\",\"\",IF(D22=FALSE,\"\",ROUND(D14+D23*0.8,1)))","v":""},"","","","","","",""]
[]
["24 hr @ 60 C"]
["Thickness",{"$f":"B12","v":"in"},"t'",{"$f":"IF(D12=\"\",\"\",D12)","v":""},{"$f":"IF(E12=\"\",\"\",E12)","v":""},"","","","","",""]
["SSD Mass, grams",null,"B'"]
["Water Absorption(B'-A)",null,"J'",{"$f":"IF(D31=\"\",\"\",D31-D14)","v":""},"","","","","","",""]
["%Saturation[100*J'/I]",null,null,{"$f":"IF(D32=\"\",\"\",ROUND(100*D32/D23,0))","v":""},"","","","","","",""]
[]
["Load, (Cond.)",{"$f":"B24","v":"lbf"},"P'",null,null,null,null,null,null,null,null,"AVERAGE"]
["Dry Strength",null,{"$f":"\"Std  \"&IF(B35=\"Newtons\",\"kPa\",\"psi\")","v":"Std  psi"},{"$f":"IF(D24=\"\",\"\",ROUND(IF($B24=\"Newtons\",IF($B12=\"mm\",2000*D24/(D13*D12*PI()),2000*D24/(D13*D12/0.00155*PI())),IF($B12=\"mm\",2*D24/(D13*D12*0.00155*PI()),2*D24/(D13*D12*PI()))),0))","v":""},{"$f":"IF(E24=\"\",\"\",ROUND(IF($B24=\"Newtons\",IF($B12=\"mm\",2000*E24/(E13*E12*PI()),2000*E24/(E13*E12/0.00155*PI())),IF($B12=\"mm\",2*E24/(E13*E12*0.00155*PI()),2*E24/(E13*E12*PI()))),0))","v":""},"","","","","","",{"$f":"IFERROR(AVERAGE(D36:K37),\"\")","v":""}]
["[(2000*P)/(t*D*3.14159)]"]
["Wet Strength",null,{"$f":"\"Stm  \"&IF(B35=\"Newtons\",\"kPa\",\"psi\")","v":"Stm  psi"},{"$f":"IF(D35=\"\",\"\",ROUND(IF($B24=\"Newtons\",IF($B12=\"mm\",2000*D35/(D30*D12*PI()),2000*D35/(D30*D12/0.00155*PI())),IF($B12=\"mm\",2*D35/(D30*D12*0.00155*PI()),2*D35/(D30*D12*PI()))),0))","v":""},{"$f":"IF(E35=\"\",\"\",ROUND(IF($B24=\"Newtons\",IF($B12=\"mm\",2000*E35/(E30*E12*PI()),2000*E35/(E30*E12/0.00155*PI())),IF($B12=\"mm\",2*E35/(E30*E12*0.00155*PI()),2*E35/(E30*E12*PI()))),0))","v":""},"","","","","","",{"$f":"IFERROR(AVERAGE(D38:K39),\"\")","v":""}]
["[(2000*P')/(t'*D*3.14159)]"]
["Visual Moisture Damage",null,"0 - 5"]
["Broken Aggregate",null,"Y/N"]
["TSR[100*Stm/Std]",null,null,{"$f":"IFERROR(IF(L38=\"\",\"\",ROUND(100*L38/L36,1)),\"\")","v":""}]

{"sheet":"Consensus","index":20,"n_rows":46,"n_cols":17,"rows_kept":46,"cut":false,"hidden":false,"merged":[[43,0,43,3],[43,5,43,6],[44,0,44,3],[44,5,44,6],[41,0,41,3],[41,5,41,6],[40,8,40,9],[42,0,42,3],[42,5,42,6],[41,8,41,9],[35,8,35,9],[36,8,36,9],[37,8,37,9],[38,8,38,9],[40,0,40,6],[39,8,39,9],[34,0,35,1],[34,2,35,2],[34,3,35,3],[34,4,35,4],[34,5,35,5],[34,8,34,9],[28,0,28,1],[28,2,28,4],[28,5,33,5],[27,11,27,14],[29,0,29,1],[29,2,29,4],[30,0,31,1],[30,2,31,2],[30,3,31,3],[30,4,31,4],[32,0,32,1],[33,0,33,1],[32,8,32,11],[33,8,33,9],[32,13,32,16],[33,13,33,15],[25,9,25,10],[25,11,25,12],[25,13,25,14],[25,15,25,16],[27,0,27,1],[26,11,26,14],[26,0,26,1],[26,2,26,3],[19,0,19,5],[19,9,19,16],[20,0,20,5],[22,11,22,12],[22,13,22,14],[22,15,22,16],[22,0,22,1],[22,2,22,3],[12,12,13,14],[3,0,3,7],[3,9,3,16],[4,0,4,1],[4,2,4,3],[4,5,4,6],[4,9,4,10],[4,11,4,12],[4,14,4,15],[12,0,13,1],[12,2,13,2],[12,3,13,5],[12,9,13,10],[12,11,13,11],[34,13,34,15],[35,13,35,15],[23,0,23,1],[23,2,23,3],[24,0,24,1],[24,2,24,3],[25,0,25,1],[25,2,25,3],[23,9,23,10],[23,11,23,12],[23,13,23,14],[23,15,23,16],[24,9,24,10],[24,11,24,12],[24,13,24,14],[24,15,24,16]]}
[null,null,null,null,null,null,null,null,"CONSENSUS TESTS"]
[]
["Technician:",null,null,null,"Date:",null,null,null,null,"Technician:",null,null,null,"Date:"]
["Flat and Elongated Particles - ASTM D4791",null,null,null,null,null,null,null,null,"Flat and Elongated Particles - ASTM D4791"]
["Ratio",null,"5 to 1",null,null,"Original Mass",null,null,null,"Ratio",null,"3 to 1",null,null,"Original Mass"]
["Sieve Sizes","Mass Retained (A)","Percent Retained (B)","Number or Mass Tested [C}","Number or Mass              F & E (D)","Percent              F & E (E)","Sieve Fraction Retained Factor (F)","Percent            F & E Weighted Ave. (G)",null,"Sieve Sizes","Mass Retained (A)","Percent Retained (B)","Number or Mass Tested [C}","Number or Mass              F & E (D)","Percent              F & E (E)","Sieve Fraction Retained Factor (F)","Percent            F & E Weighted Ave. (G)"]
["1 1/2\"",0,{"$f":"SUM(B7/$H$5*100)","v":{"$error":"#DIV/0!"}},0,0,{"$f":"IF(D7=0,0,(E7/D7)*100)","v":0},{"$f":"IFERROR(SUM(C7/$C$13),\"\")","v":""},{"$f":"IF(B7=0,0,ROUND((F7*G7),1))","v":0},null,"1 1/2\"",0,{"$f":"SUM(K7/$Q$5*100)","v":{"$error":"#DIV/0!"}},0,0,{"$f":"IF(M7=0,0,(N7/M7)*100)","v":0},{"$f":"IFERROR(SUM(L7/$L$13),\"\")","v":""},{"$f":"IF(K7=0,0,ROUND((O7*P7),1))","v":0}]
["1\"",0,{"$error":"#DIV/0!"},0,0,{"$f":"IF(D8=0,F7,(E8/D8)*100)","v":0},"",0,null,"1\"",0,{"$f":"SUM(K8/$Q$5*100)","v":{"$error":"#DIV/0!"}},0,0,{"$f":"IF(M8=0,O7,(N8/M8)*100)","v":0},"",0]
["3/4\"",0,{"$error":"#DIV/0!"},0,0,{"$f":"IF(D9=0,F8,(E9/D9)*100)","v":0},"",0,null,"3/4\"",0,{"$error":"#DIV/0!"},0,0,{"$f":"IF(M9=0,O8,(N9/M9)*100)","v":0},"",0]
["1/2\"",0,{"$error":"#DIV/0!"},0,0,{"$f":"IF(D10=0,F9,(E10/D10)*100)","v":0},"",0,null,"1/2\"",0,{"$error":"#DIV/0!"},0,0,{"$f":"IF(M10=0,O9,(N10/M10)*100)","v":0},"",0]
["3/8\"",0,{"$error":"#DIV/0!"},0,0,{"$f":"IF(D11=0,F10,(E11/D11)*100)","v":0},"",0,null,"3/8\"",0,{"$error":"#DIV/0!"},0,0,{"$f":"IF(M11=0,O10,(N11/M11)*100)","v":0},"",0]
["#4",0,{"$error":"#DIV/0!"},0,0,{"$f":"IF(D12=0,F11,(E12/D12)*100)","v":0},"",0,null,4,0,{"$error":"#DIV/0!"},0,0,{"$f":"IF(M12=0,O11,(N12/M12)*100)","v":0},"",0]
["Total % Retained     (TPR)",null,{"$f":"SUM(C7:C12)","v":{"$error":"#DIV/0!"}},null,null,null,1,null,null,"Total % Retained     (TPR)",null,{"$f":"SUM(L7:L12)","v":{"$error":"#DIV/0!"}},null,null,null,1]
[null,null,null,null,null,null,"Total",{"$f":"IF(H5=\"\",\"\",ROUND(SUM(H7:H12),0))","v":""},null,null,null,null,null,null,null,"Total",{"$f":"IF(Q5=\"\",\"\",ROUND(SUM(Q7:Q12),0))","v":""}]
["B = 100 * A / Original Mass",null,null,"F = B / TPR",null,null,null,null,null,"B = 100 * A / Original Mass",null,null,"F = B / TPR"]
["E = 100 * D / C",null,null,"G = E * F   (Total to nearest 1%)",null,null,null,null,null,"E = 100 * D / C",null,null,"G = E * F"]
[]
[]
["Technician:",null,null,null,"Date:",null,null,null,null,"Technician:",null,null,null,"Date:"]
["Uncompacted Void Content (FAA) - ",null,null,null,null,null,null,null,null,"Sand Equivalent - AASHTO T176"]
["ASTM C1252, Method A or AASHTO T304, Method A",null,null,null,null,null,null,null,null,"Stock Solution Temperature:"]
["Method A (Standard Graded Sample)",null,null,null,null,null,null,null,null,"Sedimentation Period (min.):"]
["Passing Sieve",null,"Retained Sieve",null,null,null,null,null,null,null,null,"Test # 1",null,"Test # 2",null,"Test # 3"]
["2.36mm(#8)",null,"1.18mm(#16)",null,null,"44 ± 0.2 g",null,null,null,"Clay Reading"]
["1.18mm(#16)",null,"0.600mm(#30)",null,null,"57 ± 0.2 g",null,null,null,"Sand Reading"]
["0.600mm(#30)",null,"0.300mm(#50)",null,null,"72 ± 0.2g",null,null,null,"Sand Equivalent",null,{"$f":"IFERROR(ROUNDUP(L25/L24*100,0),\"\")","v":""},null,{"$f":"IFERROR(ROUNDUP(N25/N24*100,0),\"\")","v":""},null,{"$f":"IFERROR(ROUNDUP(P25/P24*100,0),\"\")","v":""}]
["0.300mm(#50)",null,"0.150mm(#100)",null,null,"17 ± 0.2 g",null,null,null,null,null,"Average"]
[null,null,"Test # 1","Test # 2","Test # 3","Average",null,null,null,null,null,{"$f":"IF(L24=\"\",\"\",ROUND(AVERAGE(L26:Q26),0))","v":""}]
["Vol. of Measure, ml",null,null,null,null,null,null,null,null,"Sand Equivalent = 100 * Sand Reading / Clay Reading  (1%)"]
["Mass of Measure, g"]
["Mass of Measure and Sample, g"]
[null,null,null,null,null,null,null,null,"Technician:",null,"Date:",null,null,"Technician:",null,"Date:"]
["Sample Mass, g",null,{"$f":"IF(C31=\"\",\"\",C31-$C$30)","v":""},{"$f":"IF(D31=\"\",\"\",D31-$C$30)","v":""},{"$f":"IF(E31=\"\",\"\",E31-$C$30)","v":""},null,null,null,"Deleterious Content - (TM-71)",null,null,null,null,"Methylene Blue - AASHTO T 330"]
["Gsb of Aggregate",null,2.5939999999999999,{"$f":"C34","v":2.5939999999999999},{"$f":"C34","v":2.5939999999999999},null,null,null,"Original Mass",null,null,"%",null,"Mass of - #200 (g)"]
["Uncompacted Void Content (FAA)",null,{"$f":"IFERROR(($C$29-C33/C34)/$C$29*100,\"\")","v":""},{"$f":"IFERROR(($C$29-D33/D34)/$C$29*100,\"\")","v":""},{"$f":"IFERROR(($C$29-E33/E34)/$C$29*100,\"\")","v":""},{"$f":"IF(C31=\"\",\"\",ROUND(AVERAGE(C35:E36),0))","v":""},null,null,"Deleterious Rock",null,0,"by Mass",null,"Methylene Blue Solution (ml)"]
[null,null,null,null,null,null,null,null,"Del Rock & Soft Chert",null,0,{"$f":"IF(K34=0,\"\",(K36/K34)*100)","v":""},null,"Methylene Blue Value",null,null,{"$f":"IF(Q35=\"\",\"\",ROUND(0.5*Q35,1))","v":""}]
["FAA = (Vol. of Measure - Sample Mass / Gsb) / Vol. of Measure  (0.1%)",null,null,null,null,null,null,null,"Shale",null,0,{"$f":"IF(K34=0,\"\",(K37/K34)*100)","v":""}]
[null,null,null,null,null,null,null,null,"OFM",null,0,{"$f":"IF(K34=0,\"\",(K38/K34)*100)","v":""}]
[null,null,null,null,null,null,null,null,"Total Deleterious Mat.",null,{"$f":"SUM(K36:K38)","v":0},{"$f":"IF(K34=0,\"\",ROUND((K39/K34)*100,1))","v":""}]
["Technician:",null,null,null,"Date:",null,null,null,"Hard Chert",null,0]
["Percentage of Fractured Faces - ASTM D 5821",null,null,null,null,null,null,null,"Soft Chert",null,0]
["Sample Mass",null,null,null,{"$f":"H5","v":0},"100% Quarried ↓",null,"100% Quarried ↓","Total Chert Hard & Soft",null,{"$f":"SUM(K40:K41)","v":0},{"$f":"IF(K34=0,\"\",ROUND((K42/K34)*100,1))","v":""}]
["Particles with NO fractured faces, g",null,null,null,null,"% Fractured Faces",null,"Crushed Gravel ↓","Deleterious = Orig. Mass / Del. Material"]
["Particles with 1 fractured face, g",null,null,null,null,{"$f":"IF($F$42=\"100% Quarried ↓\",100,ROUND((E44+E45)/$E$42*100,0))","v":100}]
["Particles with 2 or more fractured faces,g",null,null,null,null,{"$f":"IF($F$42=\"100% Quarried ↓\",100,ROUND(E45/$E$42*100,0))","v":100}]
["Fractured Faces = 100 * Particles with Fractured Faces / Sample Mass   (1 %)"]

{"sheet":"SMA_VCA-Draindown","index":21,"n_rows":28,"n_cols":11,"rows_kept":28,"cut":false,"hidden":false,"merged":[[5,3,5,8],[27,7,27,8],[27,9,27,10],[6,3,6,8],[7,3,7,8],[8,3,8,8],[9,3,9,8],[11,6,11,7],[15,3,15,10],[0,3,0,9],[1,3,1,9],[2,3,2,8],[3,3,3,8],[4,3,4,8]]}
[null,null,null,"12.5mm SMA"]
[null,null,null,"Voids in Coarse Aggregate"]
[null,null,null,"Asphalt Content of Mixture",null,null,null,null,null,{"$f":"MO_JMF_Std!S41","v":5.4}]
[null,null,null,"Gca = Bulk Gravity of Coarse Aggregate"]
[null,null,null,"Ys = Unit Weight of Coarse Aggregate in Dry-rodded Condition"]
[null,null,null,"Yw = Unit Weight of Water",null,null,null,null,null,62.34]
[null,null,null,{"$f":"\"Pbp = Percent Aggregate by total mixture retained on #\"&IF(Initial_Info1!C7=\"SP095\",\"8\",\"4\")","v":"Pbp = Percent Aggregate by total mixture retained on #4"},null,null,null,null,null,{"$f":"(J9*J8)/100","v":94.6}]
[null,null,null,{"$f":"\"PAbp = Percent Aggregate by total aggregate retained on #\"&IF(Initial_Info1!C7=\"SP095\",\"8\",\"4\")","v":"PAbp = Percent Aggregate by total aggregate retained on #4"},null,null,null,null,null,{"$f":"IF(Initial_Info1!C7=\"SP095\",100-MO_JMF_Std!S32,100-MO_JMF_Std!S31)","v":100}]
[null,null,null,"Ps = Percent Stone",null,null,null,null,null,{"$f":"100-J3","v":94.6}]
[null,null,null,"Gmb = Mix bulk gravity",null,null,null,null,null,{"$f":"MO_JMF_Std!C39","v":{"$error":"#DIV/0!"}}]
[]
[null,null,null,"VCAmix =",{"$f":"IF(J4=0,\"\",ROUND(100-((J7*J10)/J4),1))","v":""},null,"VCA Ratio =",null,{"$f":"IF(J4=0,\"\",E12/E13)","v":""}]
[null,null,null,"VCAdrc =",{"$f":"IF(J5=0,\"\",ROUND(100*(((J4*J6)-J5))/(J4*J6),1))","v":""}]
[]
[]
[null,null,null,"Draindown Testing - AASHTO T-305"]
[null,null,null,null,null,null,null,"1A","1B","2A","2B"]
[null,null,null,"Temperature"]
[null,null,null,"Basket Wt."]
[null,null,null,"Pan/Paper Wt."]
[null,null,null,"Time IN"]
[null,null,null,"Original Wt. + Basket + Pan/Paper"]
[null,null,null,"Original Wt.",null,null,null,{"$f":"H22-H19-H20","v":0},{"$f":"I22-I19-I20","v":0},{"$f":"J22-J19-J20","v":0},{"$f":"K22-K19-K20","v":0}]
[null,null,null,"Time OUT"]
[null,null,null,"Pan/Paper Wt  + Draindown."]
[null,null,null,"Draindown Wt.",null,null,null,{"$f":"H25-H20","v":0},{"$f":"I25-I20","v":0},{"$f":"J25-J20","v":0},{"$f":"K25-K20","v":0}]
[null,null,null,"% Draindown",null,null,null,{"$f":"IF(H19=0,\"\",H26/H23*100)","v":""},{"$f":"IF(I19=0,\"\",I26/I23*100)","v":""},{"$f":"IF(J19=0,\"\",J26/J23*100)","v":""},{"$f":"IF(K19=0,\"\",K26/K23*100)","v":""}]
[null,null,null,"Average % Draindown",null,null,null,{"$f":"IF(H19=0,\"\",ROUND(AVERAGE(H27:I27),2))","v":""},null,{"$f":"IF(J19=0,\"\",ROUND(AVERAGE(J27:K27),2))","v":""}]

{"sheet":"Non-Carbonate","index":22,"n_rows":27,"n_cols":14,"rows_kept":27,"cut":false,"hidden":false,"merged":[]}
[null,null,null,null,null,"Porphyry / Non-Carbonate Aggregate By Volume"]
[]
[null,null,null,null,null,"Include Chert for Non-Carbonate Volume"]
[]
[null,null,null,null,"% Passing",null,null,"Total","Porph. / N-C"]
[null,"Material ID","Non-Polish","% Blend",{"$f":"Blending!$AC$66","v":{"$error":"#N/A"}},"Total %","Gsb","Volume","Volume","% Chert","Vol. Chert"]
[null,{"$f":"Initial_Info1!B28","v":0},{"$f":"IF(Initial_Info1!K28=\"\",1,Initial_Info1!K28)","v":0},{"$f":"IF(Blending!E4=\"\",\"\",Blending!E4)","v":""},{"$f":"IF(D7=\"\",\"\",HLOOKUP($E$6,MO_JMF_Std!$Z$3:$AV$17,2,FALSE))","v":""},{"$f":"IF(D7=\"\",\"\",ROUND(IF(Blending!$AD$66=FALSE,E7*D7/100,(100-E7)*D7/100),2))","v":""},{"$f":"IF(D7=\"\",\"\",Blending!G4)","v":""},{"$f":"IF(D7=\"\",\"\",ROUND(+F7/G7,3))","v":""},{"$f":"IF(D7=\"\",\"\",IF(C7=\"Yes\",ROUND(+F7/G7,3),\"\"))","v":""},{"$f":"IF(MO_JMF_Std!AH4=0,\"\",MO_JMF_Std!AH4)","v":""},{"$f":"IF(F7=\"\",\"\",IF(J7=\"\",\"\",ROUND(+F7/$C$21*J7/100,3)))","v":""},null,null,{"$f":"IF(OR(C7=\"Porphyry\",C7=\"Flint Chat\",ISNUMBER(SEARCH(\"slag\",C7)),ISNUMBER(SEARCH(\"grav\",C7)),C7=\"Quartzite\",C7=\"Granite\"),I7,\"\")","v":""}]
[null,{"$f":"Initial_Info1!B29","v":0},{"$f":"IF(Initial_Info1!K29=\"\",1,Initial_Info1!K29)","v":0},{"$f":"IF(Blending!E5=\"\",\"\",Blending!E5)","v":""},{"$f":"IF(D8=\"\",\"\",HLOOKUP($E$6,MO_JMF_Std!$Z$3:$AV$17,3,FALSE))","v":""},{"$f":"IF(D8=\"\",\"\",ROUND(IF(Blending!$AD$66=FALSE,E8*D8/100,(100-E8)*D8/100),2))","v":""},{"$f":"IF(D8=\"\",\"\",Blending!G5)","v":""},{"$f":"IF(D8=\"\",\"\",ROUND(+F8/G8,3))","v":""},{"$f":"IF(D8=\"\",\"\",IF(C8=\"Yes\",ROUND(+F8/G8,3),\"\"))","v":""},{"$f":"IF(MO_JMF_Std!AH5=0,\"\",MO_JMF_Std!AH5)","v":""},"",null,null,""]
[null,{"$f":"Initial_Info1!B30","v":0},{"$f":"IF(Initial_Info1!K30=\"\",1,Initial_Info1!K30)","v":0},{"$f":"IF(Blending!E6=\"\",\"\",Blending!E6)","v":""},{"$f":"IF(D9=\"\",\"\",HLOOKUP($E$6,MO_JMF_Std!$Z$3:$AV$17,4,FALSE))","v":""},{"$f":"IF(D9=\"\",\"\",ROUND(IF(Blending!$AD$66=FALSE,E9*D9/100,(100-E9)*D9/100),2))","v":""},{"$f":"IF(D9=\"\",\"\",Blending!G6)","v":""},"","",{"$f":"IF(MO_JMF_Std!AH6=0,\"\",MO_JMF_Std!AH6)","v":""},"",null,null,""]
[null,{"$f":"Initial_Info1!B31","v":0},{"$f":"IF(Initial_Info1!K31=\"\",1,Initial_Info1!K31)","v":0},{"$f":"IF(Blending!E7=\"\",\"\",Blending!E7)","v":""},{"$f":"IF(D10=\"\",\"\",HLOOKUP($E$6,MO_JMF_Std!$Z$3:$AV$17,5,FALSE))","v":""},{"$f":"IF(D10=\"\",\"\",ROUND(IF(Blending!$AD$66=FALSE,E10*D10/100,(100-E10)*D10/100),2))","v":""},{"$f":"IF(D10=\"\",\"\",Blending!G7)","v":""},"","",{"$f":"IF(MO_JMF_Std!AH7=0,\"\",MO_JMF_Std!AH7)","v":""},"",null,null,""]
[null,{"$f":"Initial_Info1!B32","v":0},{"$f":"IF(Initial_Info1!K32=\"\",1,Initial_Info1!K32)","v":0},{"$f":"IF(Blending!E8=\"\",\"\",Blending!E8)","v":""},{"$f":"IF(D11=\"\",\"\",HLOOKUP($E$6,MO_JMF_Std!$Z$3:$AV$17,6,FALSE))","v":""},{"$f":"IF(D11=\"\",\"\",ROUND(IF(Blending!$AD$66=FALSE,E11*D11/100,(100-E11)*D11/100),2))","v":""},{"$f":"IF(D11=\"\",\"\",Blending!G8)","v":""},"","",{"$f":"IF(MO_JMF_Std!AH8=0,\"\",MO_JMF_Std!AH8)","v":""},"",null,null,""]
[null,{"$f":"Initial_Info1!B35","v":0},{"$f":"IF(Initial_Info1!K35=\"\",1,Initial_Info1!K35)","v":0},{"$f":"IF(Blending!E9=\"\",\"\",Blending!E9)","v":""},{"$f":"IF(D12=\"\",\"\",HLOOKUP($E$6,MO_JMF_Std!$Z$3:$AV$17,7,FALSE))","v":""},{"$f":"IF(D12=\"\",\"\",ROUND(IF(Blending!$AD$66=FALSE,E12*D12/100,(100-E12)*D12/100),2))","v":""},{"$f":"IF(D12=\"\",\"\",Blending!G9)","v":""},"","",{"$f":"IF(MO_JMF_Std!AH9=0,\"\",MO_JMF_Std!AH9)","v":""},"",null,null,""]
[null,{"$f":"Initial_Info1!B36","v":0},{"$f":"IF(Initial_Info1!K36=\"\",1,Initial_Info1!K36)","v":0},{"$f":"IF(Blending!E10=\"\",\"\",Blending!E10)","v":""},{"$f":"IF(D13=\"\",\"\",HLOOKUP($E$6,MO_JMF_Std!$Z$3:$AV$17,8,FALSE))","v":""},{"$f":"IF(D13=\"\",\"\",ROUND(IF(Blending!$AD$66=FALSE,E13*D13/100,(100-E13)*D13/100),2))","v":""},{"$f":"IF(D13=\"\",\"\",Blending!G10)","v":""},"","",{"$f":"IF(MO_JMF_Std!AH10=0,\"\",MO_JMF_Std!AH10)","v":""},"",null,null,""]
[null,{"$f":"Initial_Info1!B37","v":0},{"$f":"IF(Initial_Info1!K37=\"\",1,Initial_Info1!K37)","v":0},{"$f":"IF(Blending!E11=\"\",\"\",Blending!E11)","v":""},{"$f":"IF(D14=\"\",\"\",HLOOKUP($E$6,MO_JMF_Std!$Z$3:$AV$17,9,FALSE))","v":""},{"$f":"IF(D14=\"\",\"\",ROUND(IF(Blending!$AD$66=FALSE,E14*D14/100,(100-E14)*D14/100),2))","v":""},{"$f":"IF(D14=\"\",\"\",Blending!G11)","v":""},"","",{"$f":"IF(MO_JMF_Std!AH11=0,\"\",MO_JMF_Std!AH11)","v":""},"",null,null,""]
[null,{"$f":"Initial_Info1!B38","v":0},{"$f":"IF(Initial_Info1!K38=\"\",1,Initial_Info1!K38)","v":0},{"$f":"IF(Blending!E12=\"\",\"\",Blending!E12)","v":""},{"$f":"IF(D15=\"\",\"\",HLOOKUP($E$6,MO_JMF_Std!$Z$3:$AV$17,10,FALSE))","v":""},{"$f":"IF(D15=\"\",\"\",ROUND(IF(Blending!$AD$66=FALSE,E15*D15/100,(100-E15)*D15/100),2))","v":""},{"$f":"IF(D15=\"\",\"\",Blending!G12)","v":""},"","",{"$f":"IF(MO_JMF_Std!AH12=0,\"\",MO_JMF_Std!AH12)","v":""},"",null,null,""]
[null,{"$f":"Initial_Info1!B39","v":0},{"$f":"IF(Initial_Info1!K39=\"\",1,Initial_Info1!K39)","v":0},{"$f":"IF(Blending!E13=\"\",\"\",Blending!E13)","v":""},{"$f":"IF(D16=\"\",\"\",HLOOKUP($E$6,MO_JMF_Std!$Z$3:$AV$17,11,FALSE))","v":""},{"$f":"IF(D16=\"\",\"\",ROUND(IF(Blending!$AD$66=FALSE,E16*D16/100,(100-E16)*D16/100),2))","v":""},{"$f":"IF(D16=\"\",\"\",Blending!G13)","v":""},"","",{"$f":"IF(MO_JMF_Std!AH13=0,\"\",MO_JMF_Std!AH13)","v":""},"",null,null,""]
[null,{"$f":"Initial_Info1!B42","v":0},{"$f":"IF(Initial_Info1!K42=\"\",1,Initial_Info1!K42)","v":0},{"$f":"IF(Blending!E14=\"\",\"\",Blending!E14)","v":""},{"$f":"IF(D17=\"\",\"\",HLOOKUP($E$6,MO_JMF_Std!$Z$3:$AV$17,12,FALSE))","v":""},{"$f":"IF(D17=\"\",\"\",ROUND(IF(Blending!$AD$66=FALSE,E17*D17/100,(100-E17)*D17/100),2))","v":""},{"$f":"IF(D17=\"\",\"\",Blending!G14)","v":""},"","",{"$f":"IF(MO_JMF_Std!AH14=0,\"\",MO_JMF_Std!AH14)","v":""},""]
[null,{"$f":"Initial_Info1!B43","v":0},{"$f":"IF(Initial_Info1!K43=\"\",1,Initial_Info1!K43)","v":0},{"$f":"IF(Blending!E15=\"\",\"\",Blending!E15)","v":""},{"$f":"IF(D18=\"\",\"\",HLOOKUP($E$6,MO_JMF_Std!$Z$3:$AV$17,13,FALSE))","v":""},{"$f":"IF(D18=\"\",\"\",ROUND(IF(Blending!$AD$66=FALSE,E18*D18/100,(100-E18)*D18/100),2))","v":""},{"$f":"IF(D18=\"\",\"\",Blending!G15)","v":""},"","",{"$f":"IF(MO_JMF_Std!AH15=0,\"\",MO_JMF_Std!AH15)","v":""},""]
[null,{"$f":"Initial_Info1!B44","v":0},{"$f":"IF(Initial_Info1!K44=\"\",1,Initial_Info1!K44)","v":0},{"$f":"IF(Blending!E16=\"\",\"\",Blending!E16)","v":""},{"$f":"IF(D19=\"\",\"\",HLOOKUP($E$6,MO_JMF_Std!$Z$3:$AV$17,14,FALSE))","v":""},{"$f":"IF(D19=\"\",\"\",ROUND(IF(Blending!$AD$66=FALSE,E19*D19/100,(100-E19)*D19/100),2))","v":""},{"$f":"IF(D19=\"\",\"\",Blending!G16)","v":""},"","",{"$f":"IF(MO_JMF_Std!AH16=0,\"\",MO_JMF_Std!AH16)","v":""},""]
[null,{"$f":"Initial_Info1!B45","v":0},{"$f":"IF(Initial_Info1!K45=\"\",1,Initial_Info1!K45)","v":0},{"$f":"IF(Blending!E17=\"\",\"\",Blending!E17)","v":""},{"$f":"IF(D20=\"\",\"\",HLOOKUP($E$6,MO_JMF_Std!$Z$3:$AV$17,15,FALSE))","v":""},{"$f":"IF(D20=\"\",\"\",ROUND(IF(Blending!$AD$66=FALSE,E20*D20/100,(100-E20)*D20/100),2))","v":""},{"$f":"IF(D20=\"\",\"\",Blending!G17)","v":""},"","",{"$f":"IF(MO_JMF_Std!AH17=0,\"\",MO_JMF_Std!AH17)","v":""},""]
[null,"Gsb Chert",2.4500000000000002]
[]
[null,null,"Total Volume","Porph. / N-C"," % Porph. / N-C",null,"Spec. Limit:",{"$f":"IF(B24=\"\",\"\",IF(OR(B24=\"+#8\",B24=\"+#16\",B24=\"+#30\"),\"Porphyry ≥ 50%\",IF(B24=\"+#4\",\"Non-Carbonate ≥ 30%\",\"Non-Carbonate ≥ 20%\")))","v":{"$error":"#N/A"}}]
[null,{"$f":"IF(Blending!AD66=TRUE,\"+\",\"-\")&E6","v":{"$error":"#N/A"}},{"$f":"SUM(H7:H20)","v":0},{"$f":"SUM(I7:I20)","v":0},{"$f":"IF(D24>0,ROUND(D24/C24*100,1),\"\")","v":""}]
[]
[null,"Including Chert","Total Volume","Porph. / N-C"," % Porph. / N-C"]
[null,{"$f":"IF(Blending!AD66=TRUE,\"+\",\"-\")&E6","v":{"$error":"#N/A"}},{"$f":"SUM(H7:H20)","v":0},{"$f":"SUM(I7:I20,K7:K20)","v":0},{"$f":"IF(D27>0,ROUND(D27/C27*100,1),\"\")","v":""}]

{"sheet":"UBAWS_Agg","index":23,"n_rows":47,"n_cols":26,"rows_kept":47,"cut":false,"hidden":false,"merged":[[24,12,24,13],[25,12,25,13],[26,12,26,13],[4,1,4,2],[4,4,4,5],[4,8,4,9],[6,8,6,9],[6,2,6,3],[22,12,22,13],[23,12,23,13],[19,14,19,15],[20,14,20,15],[21,14,21,15],[22,14,22,15],[23,14,23,15],[4,15,4,18],[6,15,6,18],[8,15,8,18],[10,15,10,18],[12,15,12,18],[6,23,6,24],[8,23,8,24],[10,23,10,24],[12,23,12,25],[46,2,46,3],[46,7,46,9],[8,2,8,4],[8,7,8,9],[14,15,14,18],[16,15,16,18],[24,14,24,15],[25,14,25,15],[26,14,26,15],[19,12,19,13],[20,12,20,13],[21,12,21,13]]}
[null,null,null,null,null,"AGGREGATE SULFATE SOUNDNESS",null,null,null,null,null,null,null,null,null,null,"LOS ANGELES ABRASION LOSS ",null,null,null,null,null,null,"MICRO-DEVAL TEST"]
[null,null,null,null,null,"(AASHTO T 104 or ASTM C86)",null,null,null,null,null,null,null,null,null,null,"(AASHTO T96 or ASTM C131)",null,null,null,null,null,null,"(ASTM D6928 or AASHTO T327)"]
[null,null,null,null,null,null,null,null,null,null,null,null,null,null,null,null,null,null,null,null,null,"DATE:"]
[]
["DATE:",null,null,"TECH:",null,null,null,"Type Sulfate Used:",null,null,null,null,"DATE:",null,null,null,null,null,null,null,null,"PROJECT NO:",null,null,"Technician:"]
[]
["PROJECT #:",null,null,null,null,null,null,"Type of Aggregate:",null,null,null,null,"PROJECT #:",null,null,null,null,null,null,null,null,"PRODUCER/CONTRACTOR:"]
[]
["PROJECT INFO:",null,null,null,null,null,"SOURCE:",null,null,null,null,null,"AGGREGATE SOURCE:",null,null,null,null,null,null,null,null,"MATERIAL TYPE:"]
[]
["PARAMETERS: ",null,"Sodium:","1.151 to 1.174 Sp. Grav.",null,null,null,"68 F to 72 F for 16 to 18 hours",null,null,null,null,"AGGREGATE GRADING:",null,null,null,null,null,null,null,null,"MAXIMUM SIZE GRADING:"]
[null,null,"Magnesium:","1.295 to 1.308 Sp. Grav.",null,null,null,"Dry @ 230 F to constant weight"]
["ID","   Size Fraction",null,"Wt.","Sieve","Weight","%","% of","Weighting","%",null,null,"LEDGE FORMATION:",null,null,null,null,null,null,null,null,"REMARKS:"]
[null,"%","%","Before","Used to","After","LOSS","Size in","FACTOR","WEIGHTED"]
[null,"PASSING","RETAINED","Test","Determine","Test",null,"Product",null,"LOSS",null,null,"Nominal Maximum Aggregate Size:",null,null,null,null,null,null,null,null,"GRADING",null,"Passing 19.0mm(3/4\")","Passing 12.5mm(1/2\")","Passing 9.5mm(3/8\")"]
[null,null,null,"(g)","Loss","(g)",null,null,null,null,"(% Pass)",null,null,null,null,null,null,null,null,null,null,"SIZE",null,"Retained 9.5mm(3/8\")","Retained 4.75mm(#4)","Retained 4.75mm(#4)"]
[null,1.5,1,null,0.625,null,{"$f":"IF(F17=\"\",\"\",IF(H17<5,G18,ROUND((D17-F17)/D17*100,1)))","v":""},{"$f":"IF(K17=\"\",\"\",100-K17)","v":""},{"$f":"IF(F17=\"\",\"\",H17/SUM($H$17:$H$27))","v":""},{"$f":"IF(F17=\"\",\"\",ROUND(G17*I17,1))","v":""},null,null,"TECHNICIAN:",null,null,null,null,null,null,null,null,"Table No.",null,1,2,3]
[null,1,0.75,null,0.625,null,{"$f":"IF(F18=\"\",\"\",IF(H18<5,G19,ROUND((D18-F18)/D18*100,1)))","v":""},{"$f":"IF(K18=\"\",\"\",K17-K18)","v":""},{"$f":"IF(F18=\"\",\"\",H18/SUM($H$17:$H$27))","v":""},{"$f":"IF(F18=\"\",\"\",ROUND(G18*I18,1))","v":""},null,null,null,null,null,null,null,null,null,null,null,"Passing Sieve","Retained Sieve"]
[null,0.75,0.5,null,0.3125,null,"",{"$f":"IF(K19=\"\",\"\",K18-K19)","v":""},"","",null,null,"GRADING:",null,null,null,"A","B","C","D",null,"19.0mm(3/4\")","16.0mm(5/8\")","375 g."]
[null,0.5,0.375,null,0.3125,null,"","","","",null,null,"Passing Sieve",null,"Retained Sieve",null,null,null,null,null,null,"16.0mm(5/8\")","12.5mm(1/2\")","375 g."]
[null,0.375,"#4",null,"#5",null,"","","","",null,null,"37.5mm(1 1/2\")",null,"25.0mm(1\")",null,"1250 ± 25 g.",null,null,null,null,"12.5mm(1/2\")","9.5mm(3/8\")","750 g","750 g"]
[null,null,null,null,null,null,"","","","",null,null,"25.0mm(1\")",null,"19.0mm(3/4\")",null,"1250 ± 25 g.",null,null,null,null,"9.5mm(3/8\")","6.3mm(1/4\")",null,"375 g.","750 g."]
[null,null,null,null,null,null,"","","","",null,null,"19.0mm(3/4\")",null,"12.5mm(1/2\")",null,"1250 ± 10 g.","2500 ± 10 g.",null,null,null,"6.3mm(1/4\")","4.75mm(#4)",null,"375 g.","750 g."]
[null,null,null,null,null,null,"","","","",null,null,"12.5mm(1/2\")",null,"9.5mm(3/8\")",null,"1250 ± 10 g.","2500 ± 10 g.",null,null,null,"TOTAL SAMPLE MASS REQUIRED:",null,"1500 +/- 5 g.","1500 +/- 5 g.","1500 +/- 5 g."]
[null,null,null,null,null,null,"","","","",null,null,"9.5mm(3/8\")",null,"6.3mm(1/4\")",null,null,null,"2500 ± 10 g.",null,null,"Water volume required (@ 20 +/- 5 C):",null,"2.0 liters +/- 0.05 liters","2.0 liters +/- 0.05 liters","2.0 liters +/- 0.05 liters"]
[null,null,null,null,null,null,"","","","",null,null,"6.3mm(1/4\")",null,"4.75mm(#4)",null,null,null,"2500 ± 10 g.",null,null,"Mass of steel balls required:",null,"5000 +/- 5 g.","5000 +/- 5 g.","5000 +/- 5 g."]
[null,null,null,null,null,null,"","","","",null,null,"4.75mm(#4)",null,"2.36mm(#8)",null,null,null,null,"5000 ± 10 g.",null,"No. of Revolutions for machine",null,"12,000 +/- 100 ","10,500 +/- 100","9500 +/- 100"]
[]
[null,null,null,null,null,"TOTAL",{"$f":"SUM(G17:G27)","v":0},null,null,{"$f":"SUM(J17:J27)","v":0},null,null,"TOTAL",null,null,null,null,null,null,null,null,"INITIAL STARTING SAMPLE MASS   (A):"]
[null,"EXAMINATION OF SIZES LARGER THAN 3/4 inch",null,null,null,null,null,null,null,null,null,null,null,null,null,null,null,null,null,null,null,null,null,null,"(report to the nearest 1.0 g.)"]
["  SIZE FRACTION",null,"#","TOTAL","      FLAKING",null,"    SPLITTING",null,"     CRACKING",null,null,null,"GRADING SELECTED"]
["Passing","Retained","before","#","#","%","#","%","#","%",null,null,null,null,null,null,null,null,null,null,null,"FINAL SAMPLE MASS  (B):"]
[null,"on","testing","After",null,null,null,null,null,null,null,null,"INITIAL STARTING SAMPLE MASS   (A):",null,null,null,null,null,null,null,null,null,null,null,"(report to the nearest 1.0 g.)"]
[1.5,1,null,null,null,{"$f":"IF($D$34<>\"\",ROUND(E34/$C$34*100,0),\"\")","v":""},null,{"$f":"IF($D$34<>\"\",ROUND(G34/$C$34*100,0),\"\")","v":""},null,{"$f":"IF($D$34<>\"\",ROUND(I34/$C$34*100,0),\"\")","v":""},null,null,null,null,null,null,null,"(report to the nearest 1.0 g.)"]
[1,0.75,null,null,null,{"$f":"IF($D$34<>\"\",ROUND(E35/$C$34*100,0),\"\")","v":""},null,{"$f":"IF($D$34<>\"\",ROUND(G35/$C$34*100,0),\"\")","v":""},null,{"$f":"IF($D$34<>\"\",ROUND(I35/$C$34*100,0),\"\")","v":""},null,null,null,null,null,null,null,null,null,null,null,"% LOSS= [ (A-B)  /A ] x 100 =",null,null,{"$f":"IF(Y32>0,ROUND((Y29-Y32)/Y29,1),\"\")","v":""}]
[null,null,null,null,null,null,null,null,null,null,null,null,"FINAL SAMPLE MASS  (B):",null,null,null,null,null,null,null,null,null,null,null,"(reported to 0.1 %)"]
[null,null,null,null,null,null,null,null,null,null,null,null,null,null,null,null,null,"(report to the nearest 1.0 g.)"]
[null,"SOLUTION DATE AND IMMERSION TIME",null,null,null,null,null,null,null,null,null,null,null,null,null,null,null,null,null,null,null,"% Loss of Last Calibration Aggregate Sample Tested:"]
[null,null,"IN BATH",null,null,"SOLUTION CHANGES",null,null,"OUT OF BATH",null,null,null,"% LA ABRASION LOSS= [ (A-B)  /A ] x 100 =",null,null,null,null,{"$f":"IF(R36>0,ROUND((R33-R36)/R33,1),\"\")","v":""},null,null,null,null,null,null,"(reported to 0.1%)"]
["CYCLE",null,"HOUR","Specific","Bath","Salt","Solution",null,"HOUR","Specific","Bath",null,null,null,null,null,null,"(reported to 0.1 %)"]
["No.","DATE","IN","Gravity","Temp.","Added","Diluted","DATE","OUT","Gravity","Temp."]
[1]
[2]
[3]
[4]
[5]
["DATE STARTED:",null,null,null,null,"DATE ENDED:"]

{"sheet":"Shot Rate","index":24,"n_rows":32,"n_cols":11,"rows_kept":32,"cut":false,"hidden":false,"merged":[[10,1,10,2],[4,0,4,1],[5,0,5,1],[6,0,6,1],[8,1,8,2],[4,2,4,3],[5,2,5,3],[7,0,7,1],[6,2,6,3],[7,2,7,3],[2,0,2,1],[3,0,3,1],[2,2,2,3],[3,2,3,3],[9,1,9,2]]}
["UBAWS Emulsion Shot Rate Calculation Worksheet for 150mm molds"]
[]
["W (grams)=",null,{"$f":"IFERROR(VLOOKUP(MO_JMF_Std!S41,Volumetrics!U48:AB52,7,TRUE),MO_JMF_Std!I40)","v":0}]
["W (pounds)=",null,{"$f":"C3/454.4","v":0}]
["h (mm)=",null,{"$f":"IFERROR(VLOOKUP(MO_JMF_Std!S41,Volumetrics!U48:AB52,8,TRUE),115)","v":115}]
["h (in)=",null,{"$f":"C5/25.4","v":4.5275590551181102}]
["D (mm)=",null,{"$f":"Initial_Info1!H7","v":150}]
["D (in)=",null,{"$f":"C7/25.4","v":5.9055118110236222}]
["Gmb =",{"$f":"ROUND((((C4/(PI()*(((C8)^2)/4)*C6))*1728)/62.4),3)","v":0}]
["Gmm=",{"$f":"IFERROR(MO_JMF_Std!C38,2.45)","v":2.4500000000000002}]
["% Voids=",{"$f":"ROUND((((B10-B9)/B10)*100),1)","v":100}]
[]
["Definitions"]
["Air Voids {Gmb Volumetric} - Lab Compacted (Val)",null,null,null,null,null,null,{"$f":"B11","v":100}]
["Air Voids - Estimated Field In-Place (Vaf) = Val + 3.5",null,null,null,null,null,null,{"$f":"IF(Val=\"\",\"\",IF(C7=150,Val+3.5,Val+1.5))","v":103.5},null,null,"+3.5% for 6\" specimen and +1.5% for 4\" specimen."]
["Largest Particle Size (Ps)",null,null,"(English)","(Metric)","Ps",null,{"$f":"IF(Blending!AA5=\"\",\"\",INDEX(E17:F20,MATCH(Blending!AA5,E17:E20,0)+1,2))","v":{"$error":"#N/A"}}]
[null,null,null,"3/4\"",19,0.75]
[null,null,null,"1/2\"",12.5,0.5]
[null,null,null,"3/8\"",9.5,0.375]
[null,null,null,"#4",4.75,0.187]
[]
["Calculating Top Size Aggregate Embedment"]
["Maximum is 70% embedment (Emax) = 0.70*Ps",null,null,null,null,null,null,{"$f":"IF(Psr=\"\",\"\",0.7*Psr)","v":{"$error":"#N/A"}}]
["Minimum is 50% embedment (Emin) = 0.50*Ps",null,null,null,null,null,null,{"$f":"IF(Psr=\"\",\"\",0.5*Psr)","v":{"$error":"#N/A"}}]
[]
["Calculating Volume of 1yd2"]
["Maximum is 70% Volume (Vmax) = 36in/yd * 36in/yd * Emax",null,null,null,null,null,null,{"$f":"IF(Emax=\"\",\"\",1296*Emax)","v":{"$error":"#N/A"}}]
["Minimum is 50% Volume (Vmin) = 36in/yd * 36in/yd * Emin",null,null,null,null,null,null,{"$f":"IF(Emin=\"\",\"\",1296*Emin)","v":{"$error":"#N/A"}}]
[]
["Calculating NovaBond Shot Rate"]
["Maximum (SRmax)= Vmax * Vaf * (1gal/231in3)",null,null,null,null,null,"max.",{"$f":"IF(Vaf=\"\",\"\",IF(ROUND(Vmax*(Vaf/100)*(1/231),3)>0.27,0.27,IF(ROUND(Vmax*(Vaf/100)*(1/231),3)<0.13,0.13,ROUND(Vmax*(Vaf/100)*(1/231),3))))","v":{"$error":"#N/A"}},"gal/yd2",0.27,"max."]
["Minimum (SRmin) = Vmin * Vaf * (1gal/231in3)",null,null,null,null,null,"min.",{"$f":"IF(Vaf=\"\",\"\",IF(ROUND(Vmin*(Vaf/100)*(1/231),3)>0.27,0.27,IF(ROUND(Vmin*(Vaf/100)*(1/231),3)<0.13,0.13,ROUND(Vmin*(Vaf/100)*(1/231),3))))","v":{"$error":"#N/A"}},"gal/yd2",0.13,"min."]

{"sheet":"Film Thickness","index":25,"n_rows":34,"n_cols":6,"rows_kept":34,"cut":false,"hidden":false,"merged":[]}
[null,null,"Film Thickness"]
[]
[null,"JMF","Spacing"]
["Sieve Size","Gradation","Factor",null,"   Mixture Properties"]
["2\"",{"$f":"Blending!C32","v":0},null,null,"% Asphalt",{"$f":"IF(MO_JMF_Std!S41=\"\",\"\",MO_JMF_Std!S41)","v":5.4}]
["1 1/2\"",{"$f":"Blending!D32","v":0},null,null,"Gb",{"$f":"IF(MO_JMF_Std!L20=\"\",\"\",MO_JMF_Std!L20)","v":0}]
["1\"",{"$f":"Blending!E32","v":0},null,null,"Gsb",{"$f":"IF(MO_JMF_Std!C40=\"\",\"\",MO_JMF_Std!C40)","v":{"$error":"#DIV/0!"}}]
["3/4\"",{"$f":"Blending!F32","v":0},2,null,"Gmb",{"$f":"IF(MO_JMF_Std!C39=\"\",\"\",MO_JMF_Std!C39)","v":{"$error":"#DIV/0!"}}]
["1/2\"",{"$f":"Blending!G32","v":0},null,null,"Gmm",{"$f":"IF(MO_JMF_Std!C38=\"\",\"\",MO_JMF_Std!C38)","v":{"$error":"#DIV/0!"}}]
["3/8\"",{"$f":"Blending!H32","v":0},null,null,"% Stone",{"$f":"100-F5","v":94.6}]
["#4",{"$f":"Blending!I32","v":0},2,null,"Gse",{"$f":"ROUND((100-F5)/((100/F9)-(F5/F6)),3)","v":{"$error":"#DIV/0!"}}]
["#8",{"$f":"Blending!J32","v":0},4]
["#16",{"$f":"Blending!K32","v":0},8]
["#30",{"$f":"Blending!L32","v":0},14]
["#50",{"$f":"Blending!M32","v":0},30]
["#100",{"$f":"Blending!N32","v":0},60]
["#200",{"$f":"Blending!O32","v":0},160]
[]
[]
["Surface Area =",{"$f":"(2*1)+(2*(B11/100))+(4*(B12/100))+(8*(B13/100))+(14*(B14/100))+(30*(B15/100))+(60*(B16/100))+(160*(B17/100))","v":2},"sq. ft/lbs",null,{"$f":"ROUND((B20/10.7639)*2.2046,3)","v":0.41},"sq. meter/Kg"]
[]
["Volume Total Asphalt =",null,{"$f":"ROUND(((F8*1000)*(F5/100))/F6,3)","v":{"$error":"#DIV/0!"}},"ML"]
[]
["% Binder Absorbed =",null,{"$f":"ROUND((((F11-F7)/(F11*F7))*F6)*100,3)","v":{"$error":"#DIV/0!"}},"%"]
[]
["Wt Absorbed Asphalt =",null,{"$f":"ROUND((F8*1000)*(F10/100)*(C24/100),3)","v":{"$error":"#DIV/0!"}},"grams"]
[]
["Volume Absorbed Asphalt =",null,{"$f":"ROUND(C26/F6,3)","v":{"$error":"#DIV/0!"}},"ML"]
[]
["Effect Volume of Asphalt =",null,{"$f":"ROUND(C22-C28,3)","v":{"$error":"#DIV/0!"}},"ML"]
[]
["Film Thickness =",null,{"$f":"ROUND((C30/(E20*(F8*1000)*(F10/100)))*1000,1)","v":{"$error":"#DIV/0!"}},"microns"]
[]
["Ultrathin Bonded Wearing Surface Range:  Min. 10.0"]